{"text_format":"3","workbook":"xlsx","n_sheets":7,"sheets":["Tips for Planning","Tips for Daily","Sprint","Team Roster","Capacity","Analysis","Project Report"],"not_rendered":{"charts":5,"images":3,"defined_names":38,"comments":1},"read":"whole","date_system":"1900"}

{"sheet":"Tips for Planning","index":0,"n_rows":79,"n_cols":1,"rows_kept":79}
[]
["These are based in Mitch Lacey (MC) original instructions"]
[]
["Project Preparation"]
[]
["1. Fill in the Team Roster, specially the alias that will be used in the other sheets. The alias should not be changed once used in the other sheets."]
["MC also recomends to fill in the Sprint Vision (Team Roster!$C$4) so its clear for all members of the team."]
[]
["2. Set the sprint start date in Capacity!$E$3 (this template version allows future dates)"]
[]
["3. Specify your options for the project in Analysis!E54:E55 (gray cells)"]
[]
["a.  SkipWeekends (Analysis!E54) - 0 = 30 days calendar; 1 = 30 working days. Do not switch after Sprint has started or data will be stored under wrong days."]
[]
["4. Specify team capacity along the sprint in Capacity"]
["a. This template has 40 days please hide the unnecessary days (columns) starting on the right. (select the columns using the mouse cursor, right click and select Hide). Please do not delete columns."]
[]
["b. Fill in every team member capacity. You have two options:"]
["i. If there is a constant capacity you should use % allocation instead of hours and set all days to 8H"]
["ii. If there isn't a constant capacity you should use % allocation=100% and set the hours in the table from 0 to 8. "]
[]
["c. Signal Hollidays, Off time and other activities as indicated in Capacity!K29:K31"]
[]
["d. Capacity!B9:C11 show if the capacity is enough or exceds the current left effort. This requires that all task's responsibles are filled in. (see ATTENTION)"]
["Yellow signals under use of resources; red, over use"]
[]
["Sprint Planning"]
[]
["5. Fill in the Sprint Backlog items in  Sprint"]
["a. This template has 40 days. You can hide the unecessary days (columns) starting on the right. (select the columns using the mouse cursor, right click and select Hide). Please do not delete columns."]
[]
["b. You have the following columns:"]
["i. Worktype - select between Feature, Tax, Precondition or Spike."]
["Feature - tasks regarding functionality that will be valuable to the user"]
["Tax - tasks regarding cost of doing business (in this case  because of SCRUM)"]
["Precondition - tasks that must happen at the completion (for instance to guarantee quality - eg: code review) "]
["Spike - tasks regarding brief experiments to learn more about na area."]
["ii. Delivery Area "]
["iii. Product Backlog Item or User Story"]
["iv. Product Backlog Item or User Story ID"]
["v. Task - Sprint Work item Description"]
["vi. Responsible - mandatory - fill in with \"no one\" if it is not yet assigned"]
[]
["c. Weekend columns are signaled. If you decided to SkipWeekends, weeks will be separated by light orange lines."]
[]
["d. To insert a new row, copy & paste an existing row. To select na entire row click in the row number on the left. Copy and paste it."]
[]
[]
[]
[]
[]
["6. Verify if the Timesheet AddIn is well configured in Sprint!$F2:$F3. The timesheet AddIn allows to import project hours already reported to SharePoint. To install this AddIn please ask for more information."]
[]
["If F and G columns are not visible, plese unhide them."]
[]
[]
[]
["a.TimesheetList2017 references the SharePoint List that keeps Timesheets from 2017. (You should change year if you are in a different year)"]
[]
["b. Fill in [Timesheet Project Code] with your project code that appears in the Timesheet exactly as it is there."]
[]
[]
["Analysis & Charts"]
[]
["7. Analyse your sprint performance in Analysis sheets "]
["a.This template has 40 days. You can hide the unecessary days (columns) starting on the right. (select the columns using the mouse cursor, right click and select Hide). Please do not delete columns.Once you hide the unecessary columns your charts will instantaneously adapt to the sprint duration."]
[]
["b. You can change burndown legend labels in Analysis!A1:A23 (gray cells)"]
[]
["c. To remenber how you read burndowns"]
["i. If Current Remaining is bellow Planned Remaining it means that the team is going faster than expected"]
["ii. If Current Remaining is equal to Planned Remaining it means that the team is going as expected"]
["iii. If Current Remaining is above Planned Remaining it means that the team is going slower than expected"]
[]
["iv. If Current Spent is bellow Planned Capacity it means that the team is working less time in the project that expected"]
["v. If Current Spent is equal to Planned Capacity it means that the team is working as planned"]
["vi. If Current Spent is above Planned Capacity it means that the team is working longer in the project than expected"]
[]
["vii. If the blue surface increases along the sprint it means that the scope has increased or that the effort that was initially planned was not enough"]

{"sheet":"Tips for Daily","index":1,"n_rows":39,"n_cols":1,"rows_kept":39}
[]
["These are based in Mitch Lacey (MC) original instructions"]
[]
["Report Progress & Assign tasks  - every day"]
[]
["1. All team members must previously report the time spent in the project tasks in the Timesheet and syncronize w/ SharePoint using Reporte Horas > Reportar."]
[]
["a. You should use the task descriptions as they are in the sprint backlog. We suggest you to copy paste it."]
[]
["2. Every day, beforey daily scrum, import all reported hours to the Sprint Backlog using the TimeSheet AddIn."]
[]
["a. If you don't have the Add In yet please do the following: Insert > My Add-ins (in Add-ins); See All and then My Organization; Select GetScrumData from CreateIT"]
[]
["b. You must logged in using your common credentials @ O365"]
[]
["c. Add-In options Get Week or day require that you previously select the day"]
[]
["d. Analyse the tasks that the AddIn reports as not beeing yet in the sprint backlog."]
[]
["3. During daily Scrum each team mumber must update the sprint backlog:"]
[]
["a. In the previous day review the effort that you think is necessary to conclude (Left column). Previous days or weekends are signaled with a dotter pattern. "]
[]
["b. Change the responsible cell in all newly assigned tasks. You can check if the capacity is under or over used in Capacity sheet."]
[]
["Analysis & Charts"]
[]
["3. Analyse your sprint performance in Analysis or Charts sheets "]
[]
["a. To remember how you read burndowns"]
["i. If Current Remaining is bellow Planned Remaining it means that the team is going faster than expected"]
["ii. If Current Remaining is equal to Planned Remaining it means that the team is going as expected"]
["iii. If Current Remaining is above Planned Remaining it means that the team is going slower than expected"]
[]
["iv. If Current Spent is bellow Planned Capacity it means that the team is working less time in the project that expected"]
["v. If Current Spent is equal to Planned Capacity it means that the team is working as planned"]
["vi. If Current Spent is above Planned Capacity it means that the team is working longer in the project than expected"]
[]
["vii. If blue surface increases along the sprint it meand that the scope has increased or that effort that was initially planned was not enough"]

{"sheet":"Sprint","index":2,"n_rows":45,"n_cols":143,"rows_kept":45,"merged":[[3,9,4,9],[3,10,4,10],[3,13,3,15],[3,16,3,18],[3,19,3,21],[3,22,3,24],[3,25,3,27],[3,28,3,30],[3,31,3,33],[3,34,3,36],[3,37,3,39],[3,40,3,42],[3,43,3,45],[3,46,3,48],[3,49,3,51],[3,52,3,54],[3,55,3,57],[3,58,3,60],[3,61,3,63],[3,64,3,66],[3,67,3,69],[3,70,3,72],[3,73,3,75],[3,76,3,78],[3,79,3,81],[3,82,3,84],[3,85,3,87],[3,88,3,90],[3,91,3,93],[3,94,3,96],[3,97,3,99],[3,100,3,102],[3,103,3,105],[3,106,3,108],[3,109,3,111],[3,112,3,114],[3,115,3,117],[3,118,3,120],[3,121,3,123],[3,124,3,126],[3,127,3,129],[3,130,3,132],[3,134,4,135],[3,136,4,137],[3,138,4,139],[3,140,4,142],[4,11,5,11],[4,12,5,12],[4,13,4,15],[4,16,4,18],[4,19,4,21],[4,22,4,24],[4,25,4,27],[4,28,4,30],[4,31,4,33],[4,34,4,36],[4,37,4,39],[4,40,4,42],[4,43,4,45],[4,46,4,48],[4,49,4,51],[4,52,4,54],[4,55,4,57],[4,58,4,60],[4,61,4,63],[4,64,4,66],[4,67,4,69],[4,70,4,72],[4,73,4,75],[4,76,4,78],[4,79,4,81],[4,82,4,84],[4,85,4,87],[4,88,4,90],[4,91,4,93],[4,94,4,96],[4,97,4,99],[4,100,4,102],[4,103,4,105],[4,106,4,108],[4,109,4,111],[4,112,4,114],[4,115,4,117],[4,118,4,120],[4,121,4,123],[4,124,4,126],[4,127,4,129],[4,130,4,132],[39,13,39,14],[39,16,39,17],[39,19,39,20],[39,22,39,23],[39,25,39,26],[39,28,39,29],[39,31,39,32],[39,34,39,35],[39,37,39,38],[39,40,39,41],[39,43,39,44],[39,46,39,47],[39,49,39,50],[39,52,39,53],[39,55,39,56],[39,58,39,59],[39,61,39,62],[39,64,39,65],[39,67,39,68],[39,70,39,71],[39,73,39,74],[39,76,39,77],[39,79,39,80],[39,82,39,83],[39,85,39,86],[39,88,39,89],[39,91,39,92],[39,94,39,95],[39,97,39,98],[39,100,39,101],[39,103,39,104],[39,106,39,107],[39,109,39,110],[39,112,39,113],[39,115,39,116],[39,118,39,119],[39,121,39,122],[39,124,39,125],[39,127,39,128],[39,130,39,131]]}
["Project: [Easy Chair]"]
[{"$nulls":5},"TimesheetList2017","2.3"]
[null,null,"Sprint [x] - [Sprint Goal]",null,null,"[Timesheet Project Code]"]
[{"$nulls":9},"Start Date",{"$f":"SprintStart","v":"2018-04-24"},null,null,{"$f":"SprintStart","v":"2018-04-24"},null,null,{"$f":"IF(AND(SkipWeekends, WEEKDAY(N4)=6),N4+3, N4+1)","v":"2018-04-25"},null,null,{"$f":"IF(AND(SkipWeekends, WEEKDAY(Q4)=6),Q4+3, Q4+1)","v":"2018-04-26"},null,null,{"$f":"IF(AND(SkipWeekends, WEEKDAY(T4)=6),T4+3, T4+1)","v":"2018-04-27"},null,null,{"$f":"IF(AND(SkipWeekends, WEEKDAY(W4)=6),W4+3, W4+1)","v":"2018-04-28"},null,null,{"$f":"IF(AND(SkipWeekends, WEEKDAY(Z4)=6),Z4+3, Z4+1)","v":"2018-04-29"},null,null,{"$f":"IF(AND(SkipWeekends, WEEKDAY(AC4)=6),AC4+3, AC4+1)","v":"2018-04-30"},null,null,{"$f":"IF(AND(SkipWeekends, WEEKDAY(AF4)=6),AF4+3, AF4+1)","v":"2018-05-01"},null,null,{"$f":"IF(AND(SkipWeekends, WEEKDAY(AI4)=6),AI4+3, AI4+1)","v":"2018-05-02"},null,null,{"$f":"IF(AND(SkipWeekends, WEEKDAY(AL4)=6),AL4+3, AL4+1)","v":"2018-05-03"},null,null,{"$f":"IF(AND(SkipWeekends, WEEKDAY(AO4)=6),AO4+3, AO4+1)","v":"2018-05-04"},null,null,{"$f":"IF(AND(SkipWeekends, WEEKDAY(AR4)=6),AR4+3, AR4+1)","v":"2018-05-05"},null,null,{"$f":"IF(AND(SkipWeekends, WEEKDAY(AU4)=6),AU4+3, AU4+1)","v":"2018-05-06"},null,null,{"$f":"IF(AND(SkipWeekends, WEEKDAY(AX4)=6),AX4+3, AX4+1)","v":"2018-05-07"},null,null,{"$f":"IF(AND(SkipWeekends, WEEKDAY(BA4)=6),BA4+3, BA4+1)","v":"2018-05-08"},null,null,{"$f":"IF(AND(SkipWeekends, WEEKDAY(BD4)=6),BD4+3, BD4+1)","v":"2018-05-09"},null,null,{"$f":"IF(AND(SkipWeekends, WEEKDAY(BG4)=6),BG4+3, BG4+1)","v":"2018-05-10"},null,null,{"$f":"IF(AND(SkipWeekends, WEEKDAY(BJ4)=6),BJ4+3, BJ4+1)","v":"2018-05-11"},null,null,{"$f":"IF(AND(SkipWeekends, WEEKDAY(BM4)=6),BM4+3, BM4+1)","v":"2018-05-12"},null,null,{"$f":"IF(AND(SkipWeekends, WEEKDAY(BP4)=6),BP4+3, BP4+1)","v":"2018-05-13"},null,null,{"$f":"IF(AND(SkipWeekends, WEEKDAY(BS4)=6),BS4+3, BS4+1)","v":"2018-05-14"},null,null,{"$f":"IF(AND(SkipWeekends, WEEKDAY(BV4)=6),BV4+3, BV4+1)","v":"2018-05-15"},null,null,{"$f":"IF(AND(SkipWeekends, WEEKDAY(BY4)=6),BY4+3, BY4+1)","v":"2018-05-16"},null,null,{"$f":"IF(AND(SkipWeekends, WEEKDAY(CB4)=6),CB4+3, CB4+1)","v":"2018-05-17"},null,null,{"$f":"IF(AND(SkipWeekends, WEEKDAY(CE4)=6),CE4+3, CE4+1)","v":"2018-05-18"},null,null,{"$f":"IF(AND(SkipWeekends, WEEKDAY(CH4)=6),CH4+3, CH4+1)","v":"2018-05-19"},null,null,{"$f":"IF(AND(SkipWeekends, WEEKDAY(CK4)=6),CK4+3, CK4+1)","v":"2018-05-20"},null,null,{"$f":"IF(AND(SkipWeekends, WEEKDAY(CN4)=6),CN4+3, CN4+1)","v":"2018-05-21"},null,null,{"$f":"IF(AND(SkipWeekends, WEEKDAY(CQ4)=6),CQ4+3, CQ4+1)","v":"2018-05-22"},null,null,{"$f":"IF(AND(SkipWeekends, WEEKDAY(CT4)=6),CT4+3, CT4+1)","v":"2018-05-23"},null,null,{"$f":"IF(AND(SkipWeekends, WEEKDAY(CW4)=6),CW4+3, CW4+1)","v":"2018-05-24"},null,null,{"$f":"IF(AND(SkipWeekends, WEEKDAY(CZ4)=6),CZ4+3, CZ4+1)","v":"2018-05-25"},null,null,{"$f":"IF(AND(SkipWeekends, WEEKDAY(DC4)=6),DC4+3, DC4+1)","v":"2018-05-26"},null,null,{"$f":"IF(AND(SkipWeekends, WEEKDAY(DF4)=6),DF4+3, DF4+1)","v":"2018-05-27"},null,null,{"$f":"IF(AND(SkipWeekends, WEEKDAY(DI4)=6),DI4+3, DI4+1)","v":"2018-05-28"},null,null,{"$f":"IF(AND(SkipWeekends, WEEKDAY(DL4)=6),DL4+3, DL4+1)","v":"2018-05-29"},null,null,{"$f":"IF(AND(SkipWeekends, WEEKDAY(DO4)=6),DO4+3, DO4+1)","v":"2018-05-30"},null,null,{"$f":"IF(AND(SkipWeekends, WEEKDAY(DR4)=6),DR4+3, DR4+1)","v":"2018-05-31"},null,null,{"$f":"IF(AND(SkipWeekends, WEEKDAY(DU4)=6),DU4+3, DU4+1)","v":"2018-06-01"},null,null,{"$f":"IF(AND(SkipWeekends, WEEKDAY(DX4)=6),DX4+3, DX4+1)","v":"2018-06-02"},{"$nulls":3},"Spent Effort",null,"Left Effort",null,"Total Effort",null,"Deviation"]
[{"$nulls":11},"Priority","Initial \nEffort","Day 1",null,null,"Day 2",null,null,"Day 3",null,null,"Day 4",null,null,"Day 5",null,null,"Day 6",null,null,"Day 7",null,null,"Day 8",null,null,"Day 9",null,null,"Day 10",null,null,"Day 11",null,null,"Day 12",null,null,"Day 13",null,null,"Day 14",null,null,"Day 15",null,null,"Day 16",null,null,"Day 17",null,null,"Day 18",null,null,"Day 19",null,null,"Day 20",null,null,"Day 21",null,null,"Day 22",null,null,"Day 23",null,null,"Day 24",null,null,"Day 25",null,null,"Day 26",null,null,"Day 27",null,null,"Day 28",null,null,"Day 29",null,null,"Day 30",null,null,"Day 31",null,null,"Day 32",null,null,"Day 33",null,null,"Day 34",null,null,"Day 35",null,null,"Day 36",null,null,"Day 37",null,null,"Day 38",null,null,"Day 39",null,null,"Day 40",{"$nulls":5},"Left Effort",null,"Total Effort"]
["Worktype","Deliverable area","PB Item or User Story","Depende Design","Actividade do processo","PB Item ID","Work item\nID","Tecnologia","Task","Responsible","Status",null,"Initial Effort","Spent","Left",null,"Spent","Left",null,"Spent","Left",null,"Spent","Left",null,"Spent","Left",null,"Spent","Left",null,"Spent","Left",null,"Spent","Left",null,"Spent","Left",null,"Spent","Left",null,"Spent","Left",null,"Spent","Left",null,"Spent","Left",null,"Spent","Left",null,"Spent","Left",null,"Spent","Left",null,"Spent","Left",null,"Spent","Left",null,"Spent","Left",null,"Spent","Left",null,"Spent","Left",null,"Spent","Left",null,"Spent","Left",null,"Spent","Left",null,"Spent","Left",null,"Spent","Left",null,"Spent","Left",null,"Spent","Left",null,"Spent","Left",null,"Spent","Left",null,"Spent","Left",null,"Spent","Left",null,"Spent","Left",null,"Spent","Left",null,"Spent","Left",null,"Spent","Left",null,"Spent","Left",null,"Spent","Left",null,"Spent","Left",null,"Spent","Left",null,null,"Hours","Days","Hours","Days","Hours","Days","Rate","Abs. Hours","Abs. Days"]
["Feature","Specification","User Story 1",{"$nulls":5},"Elicitação Reqs. Identificar Goals","MA",{"$f":"IF(SprintStart>Capacity!$F$2, \"To start\", INDEX(Burndown,ROW(K7)-ROW(K$6),MIN(Capacity!$F$2-SprintStart,29)*3+3))","v":"Complete"},null,4,4,0,{"$f":"IF(ISBLANK($I8), \"Undefined\", IF(O7<0.5, \"Complete\",IF(SUMPRODUCT($N$41:O$41,$N7:O7)<0.5, \"To start\", \"Running\")))","v":"Complete"},0,{"$f":"MAX(O7-Q7,0)","v":0},{"$f":"IF(ISBLANK($I8), \"Undefined\", IF(R7<0.5, \"Complete\",IF(SUMPRODUCT($N$41:R$41,$N7:R7)<0.5, \"To start\", \"Running\")))","v":"Complete"},0,{"$f":"MAX(R7-T7,0)","v":0},{"$f":"IF(ISBLANK($I8), \"Undefined\", IF(U7<0.5, \"Complete\",IF(SUMPRODUCT($N$41:U$41,$N7:U7)<0.5, \"To start\", \"Running\")))","v":"Complete"},0,{"$f":"MAX(U7-W7,0)","v":0},{"$f":"IF(ISBLANK($I8), \"Undefined\", IF(X7<0.5, \"Complete\",IF(SUMPRODUCT($N$41:X$41,$N7:X7)<0.5, \"To start\", \"Running\")))","v":"Complete"},0,{"$f":"MAX(X7-Z7,0)","v":0},{"$f":"IF(ISBLANK($I8), \"Undefined\", IF(AA7<0.5, \"Complete\",IF(SUMPRODUCT($N$41:AA$41,$N7:AA7)<0.5, \"To start\", \"Running\")))","v":"Complete"},0,{"$f":"MAX(AA7-AC7,0)","v":0},{"$f":"IF(ISBLANK($I8), \"Undefined\", IF(AD7<0.5, \"Complete\",IF(SUMPRODUCT($N$41:AD$41,$N7:AD7)<0.5, \"To start\", \"Running\")))","v":"Complete"},0,{"$f":"MAX(AD7-AF7,0)","v":0},{"$f":"IF(ISBLANK($I8), \"Undefined\", IF(AG7<0.5, \"Complete\",IF(SUMPRODUCT($N$41:AG$41,$N7:AG7)<0.5, \"To start\", \"Running\")))","v":"Complete"},0,{"$f":"MAX(AG7-AI7,0)","v":0},{"$f":"IF(ISBLANK($I8), \"Undefined\", IF(AJ7<0.5, \"Complete\",IF(SUMPRODUCT($N$41:AJ$41,$N7:AJ7)<0.5, \"To start\", \"Running\")))","v":"Complete"},0,{"$f":"MAX(AJ7-AL7,0)","v":0},{"$f":"IF(ISBLANK($I8), \"Undefined\", IF(AM7<0.5, \"Complete\",IF(SUMPRODUCT($N$41:AM$41,$N7:AM7)<0.5, \"To start\", \"Running\")))","v":"Complete"},0,{"$f":"MAX(AM7-AO7,0)","v":0},{"$f":"IF(ISBLANK($I8), \"Undefined\", IF(AP7<0.5, \"Complete\",IF(SUMPRODUCT($N$41:AP$41,$N7:AP7)<0.5, \"To start\", \"Running\")))","v":"Complete"},0,{"$f":"MAX(AP7-AR7,0)","v":0},{"$f":"IF(ISBLANK($I8), \"Undefined\", IF(AS7<0.5, \"Complete\",IF(SUMPRODUCT($N$41:AS$41,$N7:AS7)<0.5, \"To start\", \"Running\")))","v":"Complete"},0,{"$f":"MAX(AS7-AU7,0)","v":0},{"$f":"IF(ISBLANK($I8), \"Undefined\", IF(AV7<0.5, \"Complete\",IF(SUMPRODUCT($N$41:AV$41,$N7:AV7)<0.5, \"To start\", \"Running\")))","v":"Complete"},0,{"$f":"MAX(AV7-AX7,0)","v":0},{"$f":"IF(ISBLANK($I8), \"Undefined\", IF(AY7<0.5, \"Complete\",IF(SUMPRODUCT($N$41:AY$41,$N7:AY7)<0.5, \"To start\", \"Running\")))","v":"Complete"},0,{"$f":"MAX(AY7-BA7,0)","v":0},{"$f":"IF(ISBLANK($I8), \"Undefined\", IF(BB7<0.5, \"Complete\",IF(SUMPRODUCT($N$41:BB$41,$N7:BB7)<0.5, \"To start\", \"Running\")))","v":"Complete"},0,{"$f":"MAX(BB7-BD7,0)","v":0},{"$f":"IF(ISBLANK($I8), \"Undefined\", IF(BE7<0.5, \"Complete\",IF(SUMPRODUCT($N$41:BE$41,$N7:BE7)<0.5, \"To start\", \"Running\")))","v":"Complete"},0,{"$f":"MAX(BE7-BG7,0)","v":0},{"$f":"IF(ISBLANK($I8), \"Undefined\", IF(BH7<0.5, \"Complete\",IF(SUMPRODUCT($N$41:BH$41,$N7:BH7)<0.5, \"To start\", \"Running\")))","v":"Complete"},0,{"$f":"MAX(BH7-BJ7,0)","v":0},{"$f":"IF(ISBLANK($I8), \"Undefined\", IF(BK7<0.5, \"Complete\",IF(SUMPRODUCT($N$41:BK$41,$N7:BK7)<0.5, \"To start\", \"Running\")))","v":"Complete"},0,{"$f":"MAX(BK7-BM7,0)","v":0},{"$f":"IF(ISBLANK($I8), \"Undefined\", IF(BN7<0.5, \"Complete\",IF(SUMPRODUCT($N$41:BN$41,$N7:BN7)<0.5, \"To start\", \"Running\")))","v":"Complete"},0,{"$f":"MAX(BN7-BP7,0)","v":0},{"$f":"IF(ISBLANK($I8), \"Undefined\", IF(BQ7<0.5, \"Complete\",IF(SUMPRODUCT($N$41:BQ$41,$N7:BQ7)<0.5, \"To start\", \"Running\")))","v":"Complete"},0,{"$f":"MAX(BQ7-BS7,0)","v":0},{"$f":"IF(ISBLANK($I8), \"Undefined\", IF(BT7<0.5, \"Complete\",IF(SUMPRODUCT($N$41:BT$41,$N7:BT7)<0.5, \"To start\", \"Running\")))","v":"Complete"},0,{"$f":"MAX(BT7-BV7,0)","v":0},{"$f":"IF(ISBLANK($I8), \"Undefined\", IF(BW7<0.5, \"Complete\",IF(SUMPRODUCT($N$41:BW$41,$N7:BW7)<0.5, \"To start\", \"Running\")))","v":"Complete"},0,{"$f":"MAX(BW7-BY7,0)","v":0},{"$f":"IF(ISBLANK($I8), \"Undefined\", IF(BZ7<0.5, \"Complete\",IF(SUMPRODUCT($N$41:BZ$41,$N7:BZ7)<0.5, \"To start\", \"Running\")))","v":"Complete"},0,{"$f":"MAX(BZ7-CB7,0)","v":0},{"$f":"IF(ISBLANK($I8), \"Undefined\", IF(CC7<0.5, \"Complete\",IF(SUMPRODUCT($N$41:CC$41,$N7:CC7)<0.5, \"To start\", \"Running\")))","v":"Complete"},0,{"$f":"MAX(CC7-CE7,0)","v":0},{"$f":"IF(ISBLANK($I8), \"Undefined\", IF(CF7<0.5, \"Complete\",IF(SUMPRODUCT($N$41:CF$41,$N7:CF7)<0.5, \"To start\", \"Running\")))","v":"Complete"},0,{"$f":"MAX(CF7-CH7,0)","v":0},{"$f":"IF(ISBLANK($I8), \"Undefined\", IF(CI7<0.5, \"Complete\",IF(SUMPRODUCT($N$41:CI$41,$N7:CI7)<0.5, \"To start\", \"Running\")))","v":"Complete"},0,{"$f":"MAX(CI7-CK7,0)","v":0},{"$f":"IF(ISBLANK($I8), \"Undefined\", IF(CL7<0.5, \"Complete\",IF(SUMPRODUCT($N$41:CL$41,$N7:CL7)<0.5, \"To start\", \"Running\")))","v":"Complete"},0,{"$f":"MAX(CL7-CN7,0)","v":0},{"$f":"IF(ISBLANK($I8), \"Undefined\", IF(CO7<0.5, \"Complete\",IF(SUMPRODUCT($N$41:CO$41,$N7:CO7)<0.5, \"To start\", \"Running\")))","v":"Complete"},0,{"$f":"MAX(CO7-CQ7,0)","v":0},{"$f":"IF(ISBLANK($I8), \"Undefined\", IF(CR7<0.5, \"Complete\",IF(SUMPRODUCT($N$41:CR$41,$N7:CR7)<0.5, \"To start\", \"Running\")))","v":"Complete"},0,{"$f":"MAX(CR7-CT7,0)","v":0},{"$f":"IF(ISBLANK($I8), \"Undefined\", IF(CU7<0.5, \"Complete\",IF(SUMPRODUCT($N$41:CU$41,$N7:CU7)<0.5, \"To start\", \"Running\")))","v":"Complete"},0,{"$f":"MAX(CU7-CW7,0)","v":0},{"$f":"IF(ISBLANK($I8), \"Undefined\", IF(CX7<0.5, \"Complete\",IF(SUMPRODUCT($N$41:CX$41,$N7:CX7)<0.5, \"To start\", \"Running\")))","v":"Complete"},0,{"$f":"MAX(CX7-CZ7,0)","v":0},{"$f":"IF(ISBLANK($I8), \"Undefined\", IF(DA7<0.5, \"Complete\",IF(SUMPRODUCT($N$41:DA$41,$N7:DA7)<0.5, \"To start\", \"Running\")))","v":"Complete"},0,{"$f":"MAX(DA7-DC7,0)","v":0},{"$f":"IF(ISBLANK($I8), \"Undefined\", IF(DD7<0.5, \"Complete\",IF(SUMPRODUCT($N$41:DD$41,$N7:DD7)<0.5, \"To start\", \"Running\")))","v":"Complete"},0,{"$f":"MAX(DD7-DF7,0)","v":0},{"$f":"IF(ISBLANK($I8), \"Undefined\", IF(DG7<0.5, \"Complete\",IF(SUMPRODUCT($N$41:DG$41,$N7:DG7)<0.5, \"To start\", \"Running\")))","v":"Complete"},0,{"$f":"MAX(DG7-DI7,0)","v":0},{"$f":"IF(ISBLANK($I8), \"Undefined\", IF(DJ7<0.5, \"Complete\",IF(SUMPRODUCT($N$41:DJ$41,$N7:DJ7)<0.5, \"To start\", \"Running\")))","v":"Complete"},0,{"$f":"MAX(DJ7-DL7,0)","v":0},{"$f":"IF(ISBLANK($I8), \"Undefined\", IF(DM7<0.5, \"Complete\",IF(SUMPRODUCT($N$41:DM$41,$N7:DM7)<0.5, \"To start\", \"Running\")))","v":"Complete"},0,{"$f":"MAX(DM7-DO7,0)","v":0},{"$f":"IF(ISBLANK($I8), \"Undefined\", IF(DP7<0.5, \"Complete\",IF(SUMPRODUCT($N$41:DP$41,$N7:DP7)<0.5, \"To start\", \"Running\")))","v":"Complete"},0,{"$f":"MAX(DP7-DR7,0)","v":0},{"$f":"IF(ISBLANK($I8), \"Undefined\", IF(DS7<0.5, \"Complete\",IF(SUMPRODUCT($N$41:DS$41,$N7:DS7)<0.5, \"To start\", \"Running\")))","v":"Complete"},0,{"$f":"MAX(DS7-DU7,0)","v":0},{"$f":"IF(ISBLANK($I8), \"Undefined\", IF(DV7<0.5, \"Complete\",IF(SUMPRODUCT($N$41:DV$41,$N7:DV7)<0.5, \"To start\", \"Running\")))","v":"Complete"},0,{"$f":"MAX(DV7-DX7,0)","v":0},{"$f":"IF(ISBLANK($I8), \"Undefined\", IF(DY7<0.5, \"Complete\",IF(SUMPRODUCT($N$41:DY$41,$N7:DY7)<0.5, \"To start\", \"Running\")))","v":"Complete"},0,{"$f":"MAX(DY7-EA7,0)","v":0},{"$f":"IF(ISBLANK($I8), \"Undefined\", IF(EB7<0.5, \"Complete\",IF(SUMPRODUCT($N$41:EB$41,$N7:EB7)<0.5, \"To start\", \"Running\")))","v":"Complete"},null,{"$f":"SUMPRODUCT($L$41:DK$41,$L7:DK7)","v":4},{"$f":"EE7/8","v":0.5},{"$f":"OFFSET($O7,0,(Capacity!$F$2-SprintStart)*3,1,1)","v":0},{"$f":"EG7/8","v":0},{"$f":"EE7+EG7","v":4},{"$f":"EI7/8","v":0.5},{"$f":"IFERROR((EI7/M7)-1,\"\")","v":{"v":0,"d":"0%"}},{"$f":"EI7-M7","v":0},{"$f":"EL7/8","v":0}]
["Feature","Specification","User Story 2",{"$nulls":5},"Elicitação Reqs. Identificar Agents","MR",{"$f":"IF(SprintStart>Capacity!$F$2, \"To start\", INDEX(Burndown,ROW(K8)-ROW(K$6),MIN(Capacity!$F$2-SprintStart,29)*3+3))","v":"Complete"},null,4,0,4,{"$f":"IF(ISBLANK(#REF!), \"Undefined\", IF(O8<0.5, \"Complete\",IF(SUMPRODUCT($N$41:O$41,$N8:O8)<0.5, \"To start\", \"Running\")))","v":"To start"},4,0,{"$f":"IF(ISBLANK(#REF!), \"Undefined\", IF(R8<0.5, \"Complete\",IF(SUMPRODUCT($N$41:R$41,$N8:R8)<0.5, \"To start\", \"Running\")))","v":"Complete"},0,{"$f":"MAX(R8-T8,0)","v":0},{"$f":"IF(ISBLANK(#REF!), \"Undefined\", IF(U8<0.5, \"Complete\",IF(SUMPRODUCT($N$41:U$41,$N8:U8)<0.5, \"To start\", \"Running\")))","v":"Complete"},0,{"$f":"MAX(U8-W8,0)","v":0},{"$f":"IF(ISBLANK(#REF!), \"Undefined\", IF(X8<0.5, \"Complete\",IF(SUMPRODUCT($N$41:X$41,$N8:X8)<0.5, \"To start\", \"Running\")))","v":"Complete"},0,{"$f":"MAX(X8-Z8,0)","v":0},{"$f":"IF(ISBLANK(#REF!), \"Undefined\", IF(AA8<0.5, \"Complete\",IF(SUMPRODUCT($N$41:AA$41,$N8:AA8)<0.5, \"To start\", \"Running\")))","v":"Complete"},0,{"$f":"MAX(AA8-AC8,0)","v":0},{"$f":"IF(ISBLANK(#REF!), \"Undefined\", IF(AD8<0.5, \"Complete\",IF(SUMPRODUCT($N$41:AD$41,$N8:AD8)<0.5, \"To start\", \"Running\")))","v":"Complete"},0,{"$f":"MAX(AD8-AF8,0)","v":0},{"$f":"IF(ISBLANK(#REF!), \"Undefined\", IF(AG8<0.5, \"Complete\",IF(SUMPRODUCT($N$41:AG$41,$N8:AG8)<0.5, \"To start\", \"Running\")))","v":"Complete"},0,{"$f":"MAX(AG8-AI8,0)","v":0},{"$f":"IF(ISBLANK(#REF!), \"Undefined\", IF(AJ8<0.5, \"Complete\",IF(SUMPRODUCT($N$41:AJ$41,$N8:AJ8)<0.5, \"To start\", \"Running\")))","v":"Complete"},0,{"$f":"MAX(AJ8-AL8,0)","v":0},{"$f":"IF(ISBLANK(#REF!), \"Undefined\", IF(AM8<0.5, \"Complete\",IF(SUMPRODUCT($N$41:AM$41,$N8:AM8)<0.5, \"To start\", \"Running\")))","v":"Complete"},0,{"$f":"MAX(AM8-AO8,0)","v":0},{"$f":"IF(ISBLANK(#REF!), \"Undefined\", IF(AP8<0.5, \"Complete\",IF(SUMPRODUCT($N$41:AP$41,$N8:AP8)<0.5, \"To start\", \"Running\")))","v":"Complete"},0,{"$f":"MAX(AP8-AR8,0)","v":0},{"$f":"IF(ISBLANK(#REF!), \"Undefined\", IF(AS8<0.5, \"Complete\",IF(SUMPRODUCT($N$41:AS$41,$N8:AS8)<0.5, \"To start\", \"Running\")))","v":"Complete"},0,{"$f":"MAX(AS8-AU8,0)","v":0},{"$f":"IF(ISBLANK(#REF!), \"Undefined\", IF(AV8<0.5, \"Complete\",IF(SUMPRODUCT($N$41:AV$41,$N8:AV8)<0.5, \"To start\", \"Running\")))","v":"Complete"},0,{"$f":"MAX(AV8-AX8,0)","v":0},{"$f":"IF(ISBLANK(#REF!), \"Undefined\", IF(AY8<0.5, \"Complete\",IF(SUMPRODUCT($N$41:AY$41,$N8:AY8)<0.5, \"To start\", \"Running\")))","v":"Complete"},0,{"$f":"MAX(AY8-BA8,0)","v":0},{"$f":"IF(ISBLANK(#REF!), \"Undefined\", IF(BB8<0.5, \"Complete\",IF(SUMPRODUCT($N$41:BB$41,$N8:BB8)<0.5, \"To start\", \"Running\")))","v":"Complete"},0,{"$f":"MAX(BB8-BD8,0)","v":0},{"$f":"IF(ISBLANK(#REF!), \"Undefined\", IF(BE8<0.5, \"Complete\",IF(SUMPRODUCT($N$41:BE$41,$N8:BE8)<0.5, \"To start\", \"Running\")))","v":"Complete"},0,0,{"$f":"IF(ISBLANK(#REF!), \"Undefined\", IF(BH8<0.5, \"Complete\",IF(SUMPRODUCT($N$41:BH$41,$N8:BH8)<0.5, \"To start\", \"Running\")))","v":"Complete"},0,{"$f":"MAX(BH8-BJ8,0)","v":0},{"$f":"IF(ISBLANK(#REF!), \"Undefined\", IF(BK8<0.5, \"Complete\",IF(SUMPRODUCT($N$41:BK$41,$N8:BK8)<0.5, \"To start\", \"Running\")))","v":"Complete"},0,{"$f":"MAX(BK8-BM8,0)","v":0},{"$f":"IF(ISBLANK(#REF!), \"Undefined\", IF(BN8<0.5, \"Complete\",IF(SUMPRODUCT($N$41:BN$41,$N8:BN8)<0.5, \"To start\", \"Running\")))","v":"Complete"},0,{"$f":"MAX(BN8-BP8,0)","v":0},{"$f":"IF(ISBLANK(#REF!), \"Undefined\", IF(BQ8<0.5, \"Complete\",IF(SUMPRODUCT($N$41:BQ$41,$N8:BQ8)<0.5, \"To start\", \"Running\")))","v":"Complete"},0,{"$f":"MAX(BQ8-BS8,0)","v":0},{"$f":"IF(ISBLANK(#REF!), \"Undefined\", IF(BT8<0.5, \"Complete\",IF(SUMPRODUCT($N$41:BT$41,$N8:BT8)<0.5, \"To start\", \"Running\")))","v":"Complete"},0,{"$f":"MAX(BT8-BV8,0)","v":0},{"$f":"IF(ISBLANK(#REF!), \"Undefined\", IF(BW8<0.5, \"Complete\",IF(SUMPRODUCT($N$41:BW$41,$N8:BW8)<0.5, \"To start\", \"Running\")))","v":"Complete"},0,{"$f":"MAX(BW8-BY8,0)","v":0},{"$f":"IF(ISBLANK(#REF!), \"Undefined\", IF(BZ8<0.5, \"Complete\",IF(SUMPRODUCT($N$41:BZ$41,$N8:BZ8)<0.5, \"To start\", \"Running\")))","v":"Complete"},0,{"$f":"MAX(BZ8-CB8,0)","v":0},{"$f":"IF(ISBLANK(#REF!), \"Undefined\", IF(CC8<0.5, \"Complete\",IF(SUMPRODUCT($N$41:CC$41,$N8:CC8)<0.5, \"To start\", \"Running\")))","v":"Complete"},0,{"$f":"MAX(CC8-CE8,0)","v":0},{"$f":"IF(ISBLANK(#REF!), \"Undefined\", IF(CF8<0.5, \"Complete\",IF(SUMPRODUCT($N$41:CF$41,$N8:CF8)<0.5, \"To start\", \"Running\")))","v":"Complete"},0,{"$f":"MAX(CF8-CH8,0)","v":0},{"$f":"IF(ISBLANK(#REF!), \"Undefined\", IF(CI8<0.5, \"Complete\",IF(SUMPRODUCT($N$41:CI$41,$N8:CI8)<0.5, \"To start\", \"Running\")))","v":"Complete"},0,{"$f":"MAX(CI8-CK8,0)","v":0},{"$f":"IF(ISBLANK(#REF!), \"Undefined\", IF(CL8<0.5, \"Complete\",IF(SUMPRODUCT($N$41:CL$41,$N8:CL8)<0.5, \"To start\", \"Running\")))","v":"Complete"},0,{"$f":"MAX(CL8-CN8,0)","v":0},{"$f":"IF(ISBLANK(#REF!), \"Undefined\", IF(CO8<0.5, \"Complete\",IF(SUMPRODUCT($N$41:CO$41,$N8:CO8)<0.5, \"To start\", \"Running\")))","v":"Complete"},0,{"$f":"MAX(CO8-CQ8,0)","v":0},{"$f":"IF(ISBLANK(#REF!), \"Undefined\", IF(CR8<0.5, \"Complete\",IF(SUMPRODUCT($N$41:CR$41,$N8:CR8)<0.5, \"To start\", \"Running\")))","v":"Complete"},0,{"$f":"MAX(CR8-CT8,0)","v":0},{"$f":"IF(ISBLANK(#REF!), \"Undefined\", IF(CU8<0.5, \"Complete\",IF(SUMPRODUCT($N$41:CU$41,$N8:CU8)<0.5, \"To start\", \"Running\")))","v":"Complete"},0,{"$f":"MAX(CU8-CW8,0)","v":0},{"$f":"IF(ISBLANK(#REF!), \"Undefined\", IF(CX8<0.5, \"Complete\",IF(SUMPRODUCT($N$41:CX$41,$N8:CX8)<0.5, \"To start\", \"Running\")))","v":"Complete"},0,{"$f":"MAX(CX8-CZ8,0)","v":0},{"$f":"IF(ISBLANK(#REF!), \"Undefined\", IF(DA8<0.5, \"Complete\",IF(SUMPRODUCT($N$41:DA$41,$N8:DA8)<0.5, \"To start\", \"Running\")))","v":"Complete"},0,{"$f":"MAX(DA8-DC8,0)","v":0},{"$f":"IF(ISBLANK(#REF!), \"Undefined\", IF(DD8<0.5, \"Complete\",IF(SUMPRODUCT($N$41:DD$41,$N8:DD8)<0.5, \"To start\", \"Running\")))","v":"Complete"},0,{"$f":"MAX(DD8-DF8,0)","v":0},{"$f":"IF(ISBLANK(#REF!), \"Undefined\", IF(DG8<0.5, \"Complete\",IF(SUMPRODUCT($N$41:DG$41,$N8:DG8)<0.5, \"To start\", \"Running\")))","v":"Complete"},0,{"$f":"MAX(DG8-DI8,0)","v":0},{"$f":"IF(ISBLANK(#REF!), \"Undefined\", IF(DJ8<0.5, \"Complete\",IF(SUMPRODUCT($N$41:DJ$41,$N8:DJ8)<0.5, \"To start\", \"Running\")))","v":"Complete"},0,{"$f":"MAX(DJ8-DL8,0)","v":0},{"$f":"IF(ISBLANK(#REF!), \"Undefined\", IF(DM8<0.5, \"Complete\",IF(SUMPRODUCT($N$41:DM$41,$N8:DM8)<0.5, \"To start\", \"Running\")))","v":"Complete"},0,{"$f":"MAX(DM8-DO8,0)","v":0},{"$f":"IF(ISBLANK(#REF!), \"Undefined\", IF(DP8<0.5, \"Complete\",IF(SUMPRODUCT($N$41:DP$41,$N8:DP8)<0.5, \"To start\", \"Running\")))","v":"Complete"},0,{"$f":"MAX(DP8-DR8,0)","v":0},{"$f":"IF(ISBLANK(#REF!), \"Undefined\", IF(DS8<0.5, \"Complete\",IF(SUMPRODUCT($N$41:DS$41,$N8:DS8)<0.5, \"To start\", \"Running\")))","v":"Complete"},0,{"$f":"MAX(DS8-DU8,0)","v":0},{"$f":"IF(ISBLANK(#REF!), \"Undefined\", IF(DV8<0.5, \"Complete\",IF(SUMPRODUCT($N$41:DV$41,$N8:DV8)<0.5, \"To start\", \"Running\")))","v":"Complete"},0,{"$f":"MAX(DV8-DX8,0)","v":0},{"$f":"IF(ISBLANK(#REF!), \"Undefined\", IF(DY8<0.5, \"Complete\",IF(SUMPRODUCT($N$41:DY$41,$N8:DY8)<0.5, \"To start\", \"Running\")))","v":"Complete"},0,{"$f":"MAX(DY8-EA8,0)","v":0},{"$f":"IF(ISBLANK(#REF!), \"Undefined\", IF(EB8<0.5, \"Complete\",IF(SUMPRODUCT($N$41:EB$41,$N8:EB8)<0.5, \"To start\", \"Running\")))","v":"Complete"},null,{"$f":"SUMPRODUCT($L$41:DK$41,$L8:DK8)","v":4},{"$f":"EE8/8","v":0.5},{"$f":"OFFSET($O8,0,(Capacity!$F$2-SprintStart)*3,1,1)","v":0},0,4,{"$f":"EI8/8","v":0.5},{"$f":"IFERROR((EI8/M8)-1,\"\")","v":{"v":0,"d":"0%"}},{"$f":"EI8-M8","v":0},{"$f":"EL8/8","v":0}]
["Feature","Specification",{"$nulls":6},"Elicitação Reqs. Definição Non-Funct. Goals","JQ",{"$f":"IF(SprintStart>Capacity!$F$2, \"To start\", INDEX(Burndown,ROW(K9)-ROW(K$6),MIN(Capacity!$F$2-SprintStart,29)*3+3))","v":"Complete"},null,4,0,{"$f":"MAX(M9-N9,0)","v":4},{"$f":"IF(ISBLANK($I9), \"Undefined\", IF(O9<0.5, \"Complete\",IF(SUMPRODUCT($N$41:O$41,$N9:O9)<0.5, \"To start\", \"Running\")))","v":"To start"},0,0,{"$f":"IF(ISBLANK($I9), \"Undefined\", IF(R9<0.5, \"Complete\",IF(SUMPRODUCT($N$41:R$41,$N9:R9)<0.5, \"To start\", \"Running\")))","v":"Complete"},4,{"$f":"MAX(R9-T9,0)","v":0},{"$f":"IF(ISBLANK($I9), \"Undefined\", IF(U9<0.5, \"Complete\",IF(SUMPRODUCT($N$41:U$41,$N9:U9)<0.5, \"To start\", \"Running\")))","v":"Complete"},0,{"$f":"MAX(U9-W9,0)","v":0},{"$f":"IF(ISBLANK($I9), \"Undefined\", IF(X9<0.5, \"Complete\",IF(SUMPRODUCT($N$41:X$41,$N9:X9)<0.5, \"To start\", \"Running\")))","v":"Complete"},0,{"$f":"MAX(X9-Z9,0)","v":0},{"$f":"IF(ISBLANK($I9), \"Undefined\", IF(AA9<0.5, \"Complete\",IF(SUMPRODUCT($N$41:AA$41,$N9:AA9)<0.5, \"To start\", \"Running\")))","v":"Complete"},0,{"$f":"MAX(AA9-AC9,0)","v":0},{"$f":"IF(ISBLANK($I9), \"Undefined\", IF(AD9<0.5, \"Complete\",IF(SUMPRODUCT($N$41:AD$41,$N9:AD9)<0.5, \"To start\", \"Running\")))","v":"Complete"},0,{"$f":"MAX(AD9-AF9,0)","v":0},{"$f":"IF(ISBLANK($I9), \"Undefined\", IF(AG9<0.5, \"Complete\",IF(SUMPRODUCT($N$41:AG$41,$N9:AG9)<0.5, \"To start\", \"Running\")))","v":"Complete"},0,{"$f":"MAX(AG9-AI9,0)","v":0},{"$f":"IF(ISBLANK($I9), \"Undefined\", IF(AJ9<0.5, \"Complete\",IF(SUMPRODUCT($N$41:AJ$41,$N9:AJ9)<0.5, \"To start\", \"Running\")))","v":"Complete"},0,{"$f":"MAX(AJ9-AL9,0)","v":0},{"$f":"IF(ISBLANK($I9), \"Undefined\", IF(AM9<0.5, \"Complete\",IF(SUMPRODUCT($N$41:AM$41,$N9:AM9)<0.5, \"To start\", \"Running\")))","v":"Complete"},0,{"$f":"MAX(AM9-AO9,0)","v":0},{"$f":"IF(ISBLANK($I9), \"Undefined\", IF(AP9<0.5, \"Complete\",IF(SUMPRODUCT($N$41:AP$41,$N9:AP9)<0.5, \"To start\", \"Running\")))","v":"Complete"},0,{"$f":"MAX(AP9-AR9,0)","v":0},{"$f":"IF(ISBLANK($I9), \"Undefined\", IF(AS9<0.5, \"Complete\",IF(SUMPRODUCT($N$41:AS$41,$N9:AS9)<0.5, \"To start\", \"Running\")))","v":"Complete"},0,{"$f":"MAX(AS9-AU9,0)","v":0},{"$f":"IF(ISBLANK($I9), \"Undefined\", IF(AV9<0.5, \"Complete\",IF(SUMPRODUCT($N$41:AV$41,$N9:AV9)<0.5, \"To start\", \"Running\")))","v":"Complete"},0,{"$f":"MAX(AV9-AX9,0)","v":0},{"$f":"IF(ISBLANK($I9), \"Undefined\", IF(AY9<0.5, \"Complete\",IF(SUMPRODUCT($N$41:AY$41,$N9:AY9)<0.5, \"To start\", \"Running\")))","v":"Complete"},0,{"$f":"MAX(AY9-BA9,0)","v":0},{"$f":"IF(ISBLANK($I9), \"Undefined\", IF(BB9<0.5, \"Complete\",IF(SUMPRODUCT($N$41:BB$41,$N9:BB9)<0.5, \"To start\", \"Running\")))","v":"Complete"},0,{"$f":"MAX(BB9-BD9,0)","v":0},{"$f":"IF(ISBLANK($I9), \"Undefined\", IF(BE9<0.5, \"Complete\",IF(SUMPRODUCT($N$41:BE$41,$N9:BE9)<0.5, \"To start\", \"Running\")))","v":"Complete"},0,{"$f":"MAX(BE9-BG9,0)","v":0},{"$f":"IF(ISBLANK($I9), \"Undefined\", IF(BH9<0.5, \"Complete\",IF(SUMPRODUCT($N$41:BH$41,$N9:BH9)<0.5, \"To start\", \"Running\")))","v":"Complete"},0,{"$f":"MAX(BH9-BJ9,0)","v":0},{"$f":"IF(ISBLANK($I9), \"Undefined\", IF(BK9<0.5, \"Complete\",IF(SUMPRODUCT($N$41:BK$41,$N9:BK9)<0.5, \"To start\", \"Running\")))","v":"Complete"},0,{"$f":"MAX(BK9-BM9,0)","v":0},{"$f":"IF(ISBLANK($I9), \"Undefined\", IF(BN9<0.5, \"Complete\",IF(SUMPRODUCT($N$41:BN$41,$N9:BN9)<0.5, \"To start\", \"Running\")))","v":"Complete"},0,{"$f":"MAX(BN9-BP9,0)","v":0},{"$f":"IF(ISBLANK($I9), \"Undefined\", IF(BQ9<0.5, \"Complete\",IF(SUMPRODUCT($N$41:BQ$41,$N9:BQ9)<0.5, \"To start\", \"Running\")))","v":"Complete"},0,{"$f":"MAX(BQ9-BS9,0)","v":0},{"$f":"IF(ISBLANK($I9), \"Undefined\", IF(BT9<0.5, \"Complete\",IF(SUMPRODUCT($N$41:BT$41,$N9:BT9)<0.5, \"To start\", \"Running\")))","v":"Complete"},0,{"$f":"MAX(BT9-BV9,0)","v":0},{"$f":"IF(ISBLANK($I9), \"Undefined\", IF(BW9<0.5, \"Complete\",IF(SUMPRODUCT($N$41:BW$41,$N9:BW9)<0.5, \"To start\", \"Running\")))","v":"Complete"},0,{"$f":"MAX(BW9-BY9,0)","v":0},{"$f":"IF(ISBLANK($I9), \"Undefined\", IF(BZ9<0.5, \"Complete\",IF(SUMPRODUCT($N$41:BZ$41,$N9:BZ9)<0.5, \"To start\", \"Running\")))","v":"Complete"},0,{"$f":"MAX(BZ9-CB9,0)","v":0},{"$f":"IF(ISBLANK($I9), \"Undefined\", IF(CC9<0.5, \"Complete\",IF(SUMPRODUCT($N$41:CC$41,$N9:CC9)<0.5, \"To start\", \"Running\")))","v":"Complete"},0,{"$f":"MAX(CC9-CE9,0)","v":0},{"$f":"IF(ISBLANK($I9), \"Undefined\", IF(CF9<0.5, \"Complete\",IF(SUMPRODUCT($N$41:CF$41,$N9:CF9)<0.5, \"To start\", \"Running\")))","v":"Complete"},0,{"$f":"MAX(CF9-CH9,0)","v":0},{"$f":"IF(ISBLANK($I9), \"Undefined\", IF(CI9<0.5, \"Complete\",IF(SUMPRODUCT($N$41:CI$41,$N9:CI9)<0.5, \"To start\", \"Running\")))","v":"Complete"},0,{"$f":"MAX(CI9-CK9,0)","v":0},{"$f":"IF(ISBLANK($I9), \"Undefined\", IF(CL9<0.5, \"Complete\",IF(SUMPRODUCT($N$41:CL$41,$N9:CL9)<0.5, \"To start\", \"Running\")))","v":"Complete"},0,{"$f":"MAX(CL9-CN9,0)","v":0},{"$f":"IF(ISBLANK($I9), \"Undefined\", IF(CO9<0.5, \"Complete\",IF(SUMPRODUCT($N$41:CO$41,$N9:CO9)<0.5, \"To start\", \"Running\")))","v":"Complete"},0,{"$f":"MAX(CO9-CQ9,0)","v":0},{"$f":"IF(ISBLANK($I9), \"Undefined\", IF(CR9<0.5, \"Complete\",IF(SUMPRODUCT($N$41:CR$41,$N9:CR9)<0.5, \"To start\", \"Running\")))","v":"Complete"},0,{"$f":"MAX(CR9-CT9,0)","v":0},{"$f":"IF(ISBLANK($I9), \"Undefined\", IF(CU9<0.5, \"Complete\",IF(SUMPRODUCT($N$41:CU$41,$N9:CU9)<0.5, \"To start\", \"Running\")))","v":"Complete"},0,{"$f":"MAX(CU9-CW9,0)","v":0},{"$f":"IF(ISBLANK($I9), \"Undefined\", IF(CX9<0.5, \"Complete\",IF(SUMPRODUCT($N$41:CX$41,$N9:CX9)<0.5, \"To start\", \"Running\")))","v":"Complete"},0,{"$f":"MAX(CX9-CZ9,0)","v":0},{"$f":"IF(ISBLANK($I9), \"Undefined\", IF(DA9<0.5, \"Complete\",IF(SUMPRODUCT($N$41:DA$41,$N9:DA9)<0.5, \"To start\", \"Running\")))","v":"Complete"},0,{"$f":"MAX(DA9-DC9,0)","v":0},{"$f":"IF(ISBLANK($I9), \"Undefined\", IF(DD9<0.5, \"Complete\",IF(SUMPRODUCT($N$41:DD$41,$N9:DD9)<0.5, \"To start\", \"Running\")))","v":"Complete"},0,{"$f":"MAX(DD9-DF9,0)","v":0},{"$f":"IF(ISBLANK($I9), \"Undefined\", IF(DG9<0.5, \"Complete\",IF(SUMPRODUCT($N$41:DG$41,$N9:DG9)<0.5, \"To start\", \"Running\")))","v":"Complete"},0,{"$f":"MAX(DG9-DI9,0)","v":0},{"$f":"IF(ISBLANK($I9), \"Undefined\", IF(DJ9<0.5, \"Complete\",IF(SUMPRODUCT($N$41:DJ$41,$N9:DJ9)<0.5, \"To start\", \"Running\")))","v":"Complete"},0,{"$f":"MAX(DJ9-DL9,0)","v":0},{"$f":"IF(ISBLANK($I9), \"Undefined\", IF(DM9<0.5, \"Complete\",IF(SUMPRODUCT($N$41:DM$41,$N9:DM9)<0.5, \"To start\", \"Running\")))","v":"Complete"},0,{"$f":"MAX(DM9-DO9,0)","v":0},{"$f":"IF(ISBLANK($I9), \"Undefined\", IF(DP9<0.5, \"Complete\",IF(SUMPRODUCT($N$41:DP$41,$N9:DP9)<0.5, \"To start\", \"Running\")))","v":"Complete"},0,{"$f":"MAX(DP9-DR9,0)","v":0},{"$f":"IF(ISBLANK($I9), \"Undefined\", IF(DS9<0.5, \"Complete\",IF(SUMPRODUCT($N$41:DS$41,$N9:DS9)<0.5, \"To start\", \"Running\")))","v":"Complete"},0,{"$f":"MAX(DS9-DU9,0)","v":0},{"$f":"IF(ISBLANK($I9), \"Undefined\", IF(DV9<0.5, \"Complete\",IF(SUMPRODUCT($N$41:DV$41,$N9:DV9)<0.5, \"To start\", \"Running\")))","v":"Complete"},0,{"$f":"MAX(DV9-DX9,0)","v":0},{"$f":"IF(ISBLANK($I9), \"Undefined\", IF(DY9<0.5, \"Complete\",IF(SUMPRODUCT($N$41:DY$41,$N9:DY9)<0.5, \"To start\", \"Running\")))","v":"Complete"},0,{"$f":"MAX(DY9-EA9,0)","v":0},{"$f":"IF(ISBLANK($I9), \"Undefined\", IF(EB9<0.5, \"Complete\",IF(SUMPRODUCT($N$41:EB$41,$N9:EB9)<0.5, \"To start\", \"Running\")))","v":"Complete"},null,{"$f":"SUMPRODUCT($L$41:DK$41,$L9:DK9)","v":4},0.5,{"$f":"OFFSET($O9,0,(Capacity!$F$2-SprintStart)*3,1,1)","v":0},0,4,{"$f":"EI9/8","v":0.5},{"v":0,"d":"0%"},0,0]
["Feature","Specification",{"$nulls":6},"Elicitação Reqs. Identificar Obstaculos e Resolução","MA",{"$f":"IF(SprintStart>Capacity!$F$2, \"To start\", INDEX(Burndown,ROW(K10)-ROW(K$6),MIN(Capacity!$F$2-SprintStart,29)*3+3))","v":"Complete"},null,4,0,{"$f":"MAX(M10-N10,0)","v":4},{"$f":"IF(ISBLANK($I10), \"Undefined\", IF(O10<0.5, \"Complete\",IF(SUMPRODUCT($N$41:O$41,$N10:O10)<0.5, \"To start\", \"Running\")))","v":"To start"},0,0,{"$f":"IF(ISBLANK($I10), \"Undefined\", IF(R10<0.5, \"Complete\",IF(SUMPRODUCT($N$41:R$41,$N10:R10)<0.5, \"To start\", \"Running\")))","v":"Complete"},0,{"$f":"MAX(R10-T10,0)","v":0},{"$f":"IF(ISBLANK($I10), \"Undefined\", IF(U10<0.5, \"Complete\",IF(SUMPRODUCT($N$41:U$41,$N10:U10)<0.5, \"To start\", \"Running\")))","v":"Complete"},4,{"$f":"MAX(U10-W10,0)","v":0},{"$f":"IF(ISBLANK($I10), \"Undefined\", IF(X10<0.5, \"Complete\",IF(SUMPRODUCT($N$41:X$41,$N10:X10)<0.5, \"To start\", \"Running\")))","v":"Complete"},0,{"$f":"MAX(X10-Z10,0)","v":0},{"$f":"IF(ISBLANK($I10), \"Undefined\", IF(AA10<0.5, \"Complete\",IF(SUMPRODUCT($N$41:AA$41,$N10:AA10)<0.5, \"To start\", \"Running\")))","v":"Complete"},0,{"$f":"MAX(AA10-AC10,0)","v":0},{"$f":"IF(ISBLANK($I10), \"Undefined\", IF(AD10<0.5, \"Complete\",IF(SUMPRODUCT($N$41:AD$41,$N10:AD10)<0.5, \"To start\", \"Running\")))","v":"Complete"},0,{"$f":"MAX(AD10-AF10,0)","v":0},{"$f":"IF(ISBLANK($I10), \"Undefined\", IF(AG10<0.5, \"Complete\",IF(SUMPRODUCT($N$41:AG$41,$N10:AG10)<0.5, \"To start\", \"Running\")))","v":"Complete"},0,{"$f":"MAX(AG10-AI10,0)","v":0},{"$f":"IF(ISBLANK($I10), \"Undefined\", IF(AJ10<0.5, \"Complete\",IF(SUMPRODUCT($N$41:AJ$41,$N10:AJ10)<0.5, \"To start\", \"Running\")))","v":"Complete"},0,{"$f":"MAX(AJ10-AL10,0)","v":0},{"$f":"IF(ISBLANK($I10), \"Undefined\", IF(AM10<0.5, \"Complete\",IF(SUMPRODUCT($N$41:AM$41,$N10:AM10)<0.5, \"To start\", \"Running\")))","v":"Complete"},0,{"$f":"MAX(AM10-AO10,0)","v":0},{"$f":"IF(ISBLANK($I10), \"Undefined\", IF(AP10<0.5, \"Complete\",IF(SUMPRODUCT($N$41:AP$41,$N10:AP10)<0.5, \"To start\", \"Running\")))","v":"Complete"},0,{"$f":"MAX(AP10-AR10,0)","v":0},{"$f":"IF(ISBLANK($I10), \"Undefined\", IF(AS10<0.5, \"Complete\",IF(SUMPRODUCT($N$41:AS$41,$N10:AS10)<0.5, \"To start\", \"Running\")))","v":"Complete"},0,{"$f":"MAX(AS10-AU10,0)","v":0},{"$f":"IF(ISBLANK($I10), \"Undefined\", IF(AV10<0.5, \"Complete\",IF(SUMPRODUCT($N$41:AV$41,$N10:AV10)<0.5, \"To start\", \"Running\")))","v":"Complete"},0,{"$f":"MAX(AV10-AX10,0)","v":0},{"$f":"IF(ISBLANK($I10), \"Undefined\", IF(AY10<0.5, \"Complete\",IF(SUMPRODUCT($N$41:AY$41,$N10:AY10)<0.5, \"To start\", \"Running\")))","v":"Complete"},0,{"$f":"MAX(AY10-BA10,0)","v":0},{"$f":"IF(ISBLANK($I10), \"Undefined\", IF(BB10<0.5, \"Complete\",IF(SUMPRODUCT($N$41:BB$41,$N10:BB10)<0.5, \"To start\", \"Running\")))","v":"Complete"},0,{"$f":"MAX(BB10-BD10,0)","v":0},{"$f":"IF(ISBLANK($I10), \"Undefined\", IF(BE10<0.5, \"Complete\",IF(SUMPRODUCT($N$41:BE$41,$N10:BE10)<0.5, \"To start\", \"Running\")))","v":"Complete"},0,{"$f":"MAX(BE10-BG10,0)","v":0},{"$f":"IF(ISBLANK($I10), \"Undefined\", IF(BH10<0.5, \"Complete\",IF(SUMPRODUCT($N$41:BH$41,$N10:BH10)<0.5, \"To start\", \"Running\")))","v":"Complete"},0,{"$f":"MAX(BH10-BJ10,0)","v":0},{"$f":"IF(ISBLANK($I10), \"Undefined\", IF(BK10<0.5, \"Complete\",IF(SUMPRODUCT($N$41:BK$41,$N10:BK10)<0.5, \"To start\", \"Running\")))","v":"Complete"},0,{"$f":"MAX(BK10-BM10,0)","v":0},{"$f":"IF(ISBLANK($I10), \"Undefined\", IF(BN10<0.5, \"Complete\",IF(SUMPRODUCT($N$41:BN$41,$N10:BN10)<0.5, \"To start\", \"Running\")))","v":"Complete"},0,{"$f":"MAX(BN10-BP10,0)","v":0},{"$f":"IF(ISBLANK($I10), \"Undefined\", IF(BQ10<0.5, \"Complete\",IF(SUMPRODUCT($N$41:BQ$41,$N10:BQ10)<0.5, \"To start\", \"Running\")))","v":"Complete"},0,{"$f":"MAX(BQ10-BS10,0)","v":0},{"$f":"IF(ISBLANK($I10), \"Undefined\", IF(BT10<0.5, \"Complete\",IF(SUMPRODUCT($N$41:BT$41,$N10:BT10)<0.5, \"To start\", \"Running\")))","v":"Complete"},0,{"$f":"MAX(BT10-BV10,0)","v":0},{"$f":"IF(ISBLANK($I10), \"Undefined\", IF(BW10<0.5, \"Complete\",IF(SUMPRODUCT($N$41:BW$41,$N10:BW10)<0.5, \"To start\", \"Running\")))","v":"Complete"},0,{"$f":"MAX(BW10-BY10,0)","v":0},{"$f":"IF(ISBLANK($I10), \"Undefined\", IF(BZ10<0.5, \"Complete\",IF(SUMPRODUCT($N$41:BZ$41,$N10:BZ10)<0.5, \"To start\", \"Running\")))","v":"Complete"},0,{"$f":"MAX(BZ10-CB10,0)","v":0},{"$f":"IF(ISBLANK($I10), \"Undefined\", IF(CC10<0.5, \"Complete\",IF(SUMPRODUCT($N$41:CC$41,$N10:CC10)<0.5, \"To start\", \"Running\")))","v":"Complete"},0,{"$f":"MAX(CC10-CE10,0)","v":0},{"$f":"IF(ISBLANK($I10), \"Undefined\", IF(CF10<0.5, \"Complete\",IF(SUMPRODUCT($N$41:CF$41,$N10:CF10)<0.5, \"To start\", \"Running\")))","v":"Complete"},0,{"$f":"MAX(CF10-CH10,0)","v":0},{"$f":"IF(ISBLANK($I10), \"Undefined\", IF(CI10<0.5, \"Complete\",IF(SUMPRODUCT($N$41:CI$41,$N10:CI10)<0.5, \"To start\", \"Running\")))","v":"Complete"},0,{"$f":"MAX(CI10-CK10,0)","v":0},{"$f":"IF(ISBLANK($I10), \"Undefined\", IF(CL10<0.5, \"Complete\",IF(SUMPRODUCT($N$41:CL$41,$N10:CL10)<0.5, \"To start\", \"Running\")))","v":"Complete"},0,{"$f":"MAX(CL10-CN10,0)","v":0},{"$f":"IF(ISBLANK($I10), \"Undefined\", IF(CO10<0.5, \"Complete\",IF(SUMPRODUCT($N$41:CO$41,$N10:CO10)<0.5, \"To start\", \"Running\")))","v":"Complete"},0,{"$f":"MAX(CO10-CQ10,0)","v":0},{"$f":"IF(ISBLANK($I10), \"Undefined\", IF(CR10<0.5, \"Complete\",IF(SUMPRODUCT($N$41:CR$41,$N10:CR10)<0.5, \"To start\", \"Running\")))","v":"Complete"},0,{"$f":"MAX(CR10-CT10,0)","v":0},{"$f":"IF(ISBLANK($I10), \"Undefined\", IF(CU10<0.5, \"Complete\",IF(SUMPRODUCT($N$41:CU$41,$N10:CU10)<0.5, \"To start\", \"Running\")))","v":"Complete"},0,{"$f":"MAX(CU10-CW10,0)","v":0},{"$f":"IF(ISBLANK($I10), \"Undefined\", IF(CX10<0.5, \"Complete\",IF(SUMPRODUCT($N$41:CX$41,$N10:CX10)<0.5, \"To start\", \"Running\")))","v":"Complete"},0,{"$f":"MAX(CX10-CZ10,0)","v":0},{"$f":"IF(ISBLANK($I10), \"Undefined\", IF(DA10<0.5, \"Complete\",IF(SUMPRODUCT($N$41:DA$41,$N10:DA10)<0.5, \"To start\", \"Running\")))","v":"Complete"},0,{"$f":"MAX(DA10-DC10,0)","v":0},{"$f":"IF(ISBLANK($I10), \"Undefined\", IF(DD10<0.5, \"Complete\",IF(SUMPRODUCT($N$41:DD$41,$N10:DD10)<0.5, \"To start\", \"Running\")))","v":"Complete"},0,{"$f":"MAX(DD10-DF10,0)","v":0},{"$f":"IF(ISBLANK($I10), \"Undefined\", IF(DG10<0.5, \"Complete\",IF(SUMPRODUCT($N$41:DG$41,$N10:DG10)<0.5, \"To start\", \"Running\")))","v":"Complete"},0,{"$f":"MAX(DG10-DI10,0)","v":0},{"$f":"IF(ISBLANK($I10), \"Undefined\", IF(DJ10<0.5, \"Complete\",IF(SUMPRODUCT($N$41:DJ$41,$N10:DJ10)<0.5, \"To start\", \"Running\")))","v":"Complete"},0,{"$f":"MAX(DJ10-DL10,0)","v":0},{"$f":"IF(ISBLANK($I10), \"Undefined\", IF(DM10<0.5, \"Complete\",IF(SUMPRODUCT($N$41:DM$41,$N10:DM10)<0.5, \"To start\", \"Running\")))","v":"Complete"},0,{"$f":"MAX(DM10-DO10,0)","v":0},{"$f":"IF(ISBLANK($I10), \"Undefined\", IF(DP10<0.5, \"Complete\",IF(SUMPRODUCT($N$41:DP$41,$N10:DP10)<0.5, \"To start\", \"Running\")))","v":"Complete"},0,{"$f":"MAX(DP10-DR10,0)","v":0},{"$f":"IF(ISBLANK($I10), \"Undefined\", IF(DS10<0.5, \"Complete\",IF(SUMPRODUCT($N$41:DS$41,$N10:DS10)<0.5, \"To start\", \"Running\")))","v":"Complete"},0,{"$f":"MAX(DS10-DU10,0)","v":0},{"$f":"IF(ISBLANK($I10), \"Undefined\", IF(DV10<0.5, \"Complete\",IF(SUMPRODUCT($N$41:DV$41,$N10:DV10)<0.5, \"To start\", \"Running\")))","v":"Complete"},0,{"$f":"MAX(DV10-DX10,0)","v":0},{"$f":"IF(ISBLANK($I10), \"Undefined\", IF(DY10<0.5, \"Complete\",IF(SUMPRODUCT($N$41:DY$41,$N10:DY10)<0.5, \"To start\", \"Running\")))","v":"Complete"},0,{"$f":"MAX(DY10-EA10,0)","v":0},{"$f":"IF(ISBLANK($I10), \"Undefined\", IF(EB10<0.5, \"Complete\",IF(SUMPRODUCT($N$41:EB$41,$N10:EB10)<0.5, \"To start\", \"Running\")))","v":"Complete"},null,{"$f":"SUMPRODUCT($L$41:DK$41,$L10:DK10)","v":4},{"$f":"EE10/8","v":0.5},{"$f":"OFFSET($O10,0,(Capacity!$F$2-SprintStart)*3,1,1)","v":0},{"$f":"EG10/8","v":0},{"$f":"EE10+EG10","v":4},{"$f":"EI10/8","v":0.5},{"$f":"IFERROR((EI10/M10)-1,\"\")","v":{"v":0,"d":"0%"}},{"$f":"EI10-M10","v":0},{"$f":"EL10/8","v":0}]
["Feature","Specification",{"$nulls":6},"Elicitação Reqs. Identiciar Objectos e Operações","MA",{"$f":"IF(SprintStart>Capacity!$F$2, \"To start\", INDEX(Burndown,ROW(K11)-ROW(K$6),MIN(Capacity!$F$2-SprintStart,29)*3+3))","v":"Complete"},null,4,0,4,{"$f":"IF(ISBLANK(#REF!), \"Undefined\", IF(O11<0.5, \"Complete\",IF(SUMPRODUCT($N$41:O$41,$N11:O11)<0.5, \"To start\", \"Running\")))","v":"To start"},0,0,{"$f":"IF(ISBLANK(#REF!), \"Undefined\", IF(R11<0.5, \"Complete\",IF(SUMPRODUCT($N$41:R$41,$N11:R11)<0.5, \"To start\", \"Running\")))","v":"Complete"},0,0,{"$f":"IF(ISBLANK(#REF!), \"Undefined\", IF(U11<0.5, \"Complete\",IF(SUMPRODUCT($N$41:U$41,$N11:U11)<0.5, \"To start\", \"Running\")))","v":"Complete"},0,0,{"$f":"IF(ISBLANK(#REF!), \"Undefined\", IF(X11<0.5, \"Complete\",IF(SUMPRODUCT($N$41:X$41,$N11:X11)<0.5, \"To start\", \"Running\")))","v":"Complete"},4,0,{"$f":"IF(ISBLANK(#REF!), \"Undefined\", IF(AA11<0.5, \"Complete\",IF(SUMPRODUCT($N$41:AA$41,$N11:AA11)<0.5, \"To start\", \"Running\")))","v":"Complete"},0,0,{"$f":"IF(ISBLANK(#REF!), \"Undefined\", IF(AD11<0.5, \"Complete\",IF(SUMPRODUCT($N$41:AD$41,$N11:AD11)<0.5, \"To start\", \"Running\")))","v":"Complete"},0,0,{"$f":"IF(ISBLANK(#REF!), \"Undefined\", IF(AG11<0.5, \"Complete\",IF(SUMPRODUCT($N$41:AG$41,$N11:AG11)<0.5, \"To start\", \"Running\")))","v":"Complete"},0,0,{"$f":"IF(ISBLANK(#REF!), \"Undefined\", IF(AJ11<0.5, \"Complete\",IF(SUMPRODUCT($N$41:AJ$41,$N11:AJ11)<0.5, \"To start\", \"Running\")))","v":"Complete"},0,0,{"$f":"IF(ISBLANK(#REF!), \"Undefined\", IF(AM11<0.5, \"Complete\",IF(SUMPRODUCT($N$41:AM$41,$N11:AM11)<0.5, \"To start\", \"Running\")))","v":"Complete"},0,0,{"$f":"IF(ISBLANK(#REF!), \"Undefined\", IF(AP11<0.5, \"Complete\",IF(SUMPRODUCT($N$41:AP$41,$N11:AP11)<0.5, \"To start\", \"Running\")))","v":"Complete"},0,0,{"$f":"IF(ISBLANK(#REF!), \"Undefined\", IF(AS11<0.5, \"Complete\",IF(SUMPRODUCT($N$41:AS$41,$N11:AS11)<0.5, \"To start\", \"Running\")))","v":"Complete"},0,0,{"$f":"IF(ISBLANK(#REF!), \"Undefined\", IF(AV11<0.5, \"Complete\",IF(SUMPRODUCT($N$41:AV$41,$N11:AV11)<0.5, \"To start\", \"Running\")))","v":"Complete"},0,0,{"$f":"IF(ISBLANK(#REF!), \"Undefined\", IF(AY11<0.5, \"Complete\",IF(SUMPRODUCT($N$41:AY$41,$N11:AY11)<0.5, \"To start\", \"Running\")))","v":"Complete"},0,0,{"$f":"IF(ISBLANK(#REF!), \"Undefined\", IF(BB11<0.5, \"Complete\",IF(SUMPRODUCT($N$41:BB$41,$N11:BB11)<0.5, \"To start\", \"Running\")))","v":"Complete"},0,0,{"$f":"IF(ISBLANK(#REF!), \"Undefined\", IF(BE11<0.5, \"Complete\",IF(SUMPRODUCT($N$41:BE$41,$N11:BE11)<0.5, \"To start\", \"Running\")))","v":"Complete"},0,0,{"$f":"IF(ISBLANK(#REF!), \"Undefined\", IF(BH11<0.5, \"Complete\",IF(SUMPRODUCT($N$41:BH$41,$N11:BH11)<0.5, \"To start\", \"Running\")))","v":"Complete"},0,0,{"$f":"IF(ISBLANK(#REF!), \"Undefined\", IF(BK11<0.5, \"Complete\",IF(SUMPRODUCT($N$41:BK$41,$N11:BK11)<0.5, \"To start\", \"Running\")))","v":"Complete"},0,0,{"$f":"IF(ISBLANK(#REF!), \"Undefined\", IF(BN11<0.5, \"Complete\",IF(SUMPRODUCT($N$41:BN$41,$N11:BN11)<0.5, \"To start\", \"Running\")))","v":"Complete"},0,0,{"$f":"IF(ISBLANK(#REF!), \"Undefined\", IF(BQ11<0.5, \"Complete\",IF(SUMPRODUCT($N$41:BQ$41,$N11:BQ11)<0.5, \"To start\", \"Running\")))","v":"Complete"},0,0,{"$f":"IF(ISBLANK(#REF!), \"Undefined\", IF(BT11<0.5, \"Complete\",IF(SUMPRODUCT($N$41:BT$41,$N11:BT11)<0.5, \"To start\", \"Running\")))","v":"Complete"},0,0,{"$f":"IF(ISBLANK(#REF!), \"Undefined\", IF(BW11<0.5, \"Complete\",IF(SUMPRODUCT($N$41:BW$41,$N11:BW11)<0.5, \"To start\", \"Running\")))","v":"Complete"},0,0,{"$f":"IF(ISBLANK(#REF!), \"Undefined\", IF(BZ11<0.5, \"Complete\",IF(SUMPRODUCT($N$41:BZ$41,$N11:BZ11)<0.5, \"To start\", \"Running\")))","v":"Complete"},0,0,{"$f":"IF(ISBLANK(#REF!), \"Undefined\", IF(CC11<0.5, \"Complete\",IF(SUMPRODUCT($N$41:CC$41,$N11:CC11)<0.5, \"To start\", \"Running\")))","v":"Complete"},0,0,{"$f":"IF(ISBLANK(#REF!), \"Undefined\", IF(CF11<0.5, \"Complete\",IF(SUMPRODUCT($N$41:CF$41,$N11:CF11)<0.5, \"To start\", \"Running\")))","v":"Complete"},0,0,{"$f":"IF(ISBLANK(#REF!), \"Undefined\", IF(CI11<0.5, \"Complete\",IF(SUMPRODUCT($N$41:CI$41,$N11:CI11)<0.5, \"To start\", \"Running\")))","v":"Complete"},0,0,{"$f":"IF(ISBLANK(#REF!), \"Undefined\", IF(CL11<0.5, \"Complete\",IF(SUMPRODUCT($N$41:CL$41,$N11:CL11)<0.5, \"To start\", \"Running\")))","v":"Complete"},0,0,{"$f":"IF(ISBLANK(#REF!), \"Undefined\", IF(CO11<0.5, \"Complete\",IF(SUMPRODUCT($N$41:CO$41,$N11:CO11)<0.5, \"To start\", \"Running\")))","v":"Complete"},0,0,{"$f":"IF(ISBLANK(#REF!), \"Undefined\", IF(CR11<0.5, \"Complete\",IF(SUMPRODUCT($N$41:CR$41,$N11:CR11)<0.5, \"To start\", \"Running\")))","v":"Complete"},0,0,{"$f":"IF(ISBLANK(#REF!), \"Undefined\", IF(CU11<0.5, \"Complete\",IF(SUMPRODUCT($N$41:CU$41,$N11:CU11)<0.5, \"To start\", \"Running\")))","v":"Complete"},0,0,{"$f":"IF(ISBLANK(#REF!), \"Undefined\", IF(CX11<0.5, \"Complete\",IF(SUMPRODUCT($N$41:CX$41,$N11:CX11)<0.5, \"To start\", \"Running\")))","v":"Complete"},0,0,{"$f":"IF(ISBLANK(#REF!), \"Undefined\", IF(DA11<0.5, \"Complete\",IF(SUMPRODUCT($N$41:DA$41,$N11:DA11)<0.5, \"To start\", \"Running\")))","v":"Complete"},0,0,{"$f":"IF(ISBLANK(#REF!), \"Undefined\", IF(DD11<0.5, \"Complete\",IF(SUMPRODUCT($N$41:DD$41,$N11:DD11)<0.5, \"To start\", \"Running\")))","v":"Complete"},0,0,{"$f":"IF(ISBLANK(#REF!), \"Undefined\", IF(DG11<0.5, \"Complete\",IF(SUMPRODUCT($N$41:DG$41,$N11:DG11)<0.5, \"To start\", \"Running\")))","v":"Complete"},0,0,{"$f":"IF(ISBLANK(#REF!), \"Undefined\", IF(DJ11<0.5, \"Complete\",IF(SUMPRODUCT($N$41:DJ$41,$N11:DJ11)<0.5, \"To start\", \"Running\")))","v":"Complete"},0,0,{"$f":"IF(ISBLANK(#REF!), \"Undefined\", IF(DM11<0.5, \"Complete\",IF(SUMPRODUCT($N$41:DM$41,$N11:DM11)<0.5, \"To start\", \"Running\")))","v":"Complete"},0,0,{"$f":"IF(ISBLANK(#REF!), \"Undefined\", IF(DP11<0.5, \"Complete\",IF(SUMPRODUCT($N$41:DP$41,$N11:DP11)<0.5, \"To start\", \"Running\")))","v":"Complete"},0,0,{"$f":"IF(ISBLANK(#REF!), \"Undefined\", IF(DS11<0.5, \"Complete\",IF(SUMPRODUCT($N$41:DS$41,$N11:DS11)<0.5, \"To start\", \"Running\")))","v":"Complete"},0,0,{"$f":"IF(ISBLANK(#REF!), \"Undefined\", IF(DV11<0.5, \"Complete\",IF(SUMPRODUCT($N$41:DV$41,$N11:DV11)<0.5, \"To start\", \"Running\")))","v":"Complete"},0,0,{"$f":"IF(ISBLANK(#REF!), \"Undefined\", IF(DY11<0.5, \"Complete\",IF(SUMPRODUCT($N$41:DY$41,$N11:DY11)<0.5, \"To start\", \"Running\")))","v":"Complete"},0,0,{"$f":"IF(ISBLANK(#REF!), \"Undefined\", IF(EB11<0.5, \"Complete\",IF(SUMPRODUCT($N$41:EB$41,$N11:EB11)<0.5, \"To start\", \"Running\")))","v":"Complete"},null,{"$f":"SUMPRODUCT($L$41:DK$41,$L11:DK11)","v":4},0.5,{"$f":"OFFSET($O11,0,(Capacity!$F$2-SprintStart)*3,1,1)","v":0},0,4,0.5,{"v":0,"d":"0%"},0,0]
["Feature","Specification",{"$nulls":6},"Análise de Reqs. Escolher Parafigma Orientado a Objectos","MA",{"$f":"IF(SprintStart>Capacity!$F$2, \"To start\", INDEX(Burndown,ROW(K12)-ROW(K$6),MIN(Capacity!$F$2-SprintStart,29)*3+3))","v":"Complete"},null,4,0,4,{"$f":"IF(ISBLANK($I11), \"Undefined\", IF(O12<0.5, \"Complete\",IF(SUMPRODUCT($N$41:O$41,$N12:O12)<0.5, \"To start\", \"Running\")))","v":"To start"},0,{"$f":"MAX(O12-Q12,0)","v":4},{"$f":"IF(ISBLANK($I11), \"Undefined\", IF(R12<0.5, \"Complete\",IF(SUMPRODUCT($N$41:R$41,$N12:R12)<0.5, \"To start\", \"Running\")))","v":"To start"},0,4,{"$f":"IF(ISBLANK($I11), \"Undefined\", IF(U12<0.5, \"Complete\",IF(SUMPRODUCT($N$41:U$41,$N12:U12)<0.5, \"To start\", \"Running\")))","v":"To start"},0,4,{"$f":"IF(ISBLANK($I11), \"Undefined\", IF(X12<0.5, \"Complete\",IF(SUMPRODUCT($N$41:X$41,$N12:X12)<0.5, \"To start\", \"Running\")))","v":"To start"},0,4,{"$f":"IF(ISBLANK($I11), \"Undefined\", IF(AA12<0.5, \"Complete\",IF(SUMPRODUCT($N$41:AA$41,$N12:AA12)<0.5, \"To start\", \"Running\")))","v":"To start"},4,0,{"$f":"IF(ISBLANK($I11), \"Undefined\", IF(AD12<0.5, \"Complete\",IF(SUMPRODUCT($N$41:AD$41,$N12:AD12)<0.5, \"To start\", \"Running\")))","v":"Complete"},0,0,{"$f":"IF(ISBLANK($I11), \"Undefined\", IF(AG12<0.5, \"Complete\",IF(SUMPRODUCT($N$41:AG$41,$N12:AG12)<0.5, \"To start\", \"Running\")))","v":"Complete"},8,0,{"$f":"IF(ISBLANK($I11), \"Undefined\", IF(AJ12<0.5, \"Complete\",IF(SUMPRODUCT($N$41:AJ$41,$N12:AJ12)<0.5, \"To start\", \"Running\")))","v":"Complete"},0,0,{"$f":"IF(ISBLANK($I11), \"Undefined\", IF(AM12<0.5, \"Complete\",IF(SUMPRODUCT($N$41:AM$41,$N12:AM12)<0.5, \"To start\", \"Running\")))","v":"Complete"},0,0,{"$f":"IF(ISBLANK($I11), \"Undefined\", IF(AP12<0.5, \"Complete\",IF(SUMPRODUCT($N$41:AP$41,$N12:AP12)<0.5, \"To start\", \"Running\")))","v":"Complete"},0,0,{"$f":"IF(ISBLANK($I11), \"Undefined\", IF(AS12<0.5, \"Complete\",IF(SUMPRODUCT($N$41:AS$41,$N12:AS12)<0.5, \"To start\", \"Running\")))","v":"Complete"},0,0,{"$f":"IF(ISBLANK($I11), \"Undefined\", IF(AV12<0.5, \"Complete\",IF(SUMPRODUCT($N$41:AV$41,$N12:AV12)<0.5, \"To start\", \"Running\")))","v":"Complete"},0,0,{"$f":"IF(ISBLANK($I11), \"Undefined\", IF(AY12<0.5, \"Complete\",IF(SUMPRODUCT($N$41:AY$41,$N12:AY12)<0.5, \"To start\", \"Running\")))","v":"Complete"},0,0,{"$f":"IF(ISBLANK($I11), \"Undefined\", IF(BB12<0.5, \"Complete\",IF(SUMPRODUCT($N$41:BB$41,$N12:BB12)<0.5, \"To start\", \"Running\")))","v":"Complete"},0,0,{"$f":"IF(ISBLANK($I11), \"Undefined\", IF(BE12<0.5, \"Complete\",IF(SUMPRODUCT($N$41:BE$41,$N12:BE12)<0.5, \"To start\", \"Running\")))","v":"Complete"},0,0,{"$f":"IF(ISBLANK($I11), \"Undefined\", IF(BH12<0.5, \"Complete\",IF(SUMPRODUCT($N$41:BH$41,$N12:BH12)<0.5, \"To start\", \"Running\")))","v":"Complete"},0,0,{"$f":"IF(ISBLANK($I11), \"Undefined\", IF(BK12<0.5, \"Complete\",IF(SUMPRODUCT($N$41:BK$41,$N12:BK12)<0.5, \"To start\", \"Running\")))","v":"Complete"},0,0,{"$f":"IF(ISBLANK($I11), \"Undefined\", IF(BN12<0.5, \"Complete\",IF(SUMPRODUCT($N$41:BN$41,$N12:BN12)<0.5, \"To start\", \"Running\")))","v":"Complete"},0,0,{"$f":"IF(ISBLANK($I11), \"Undefined\", IF(BQ12<0.5, \"Complete\",IF(SUMPRODUCT($N$41:BQ$41,$N12:BQ12)<0.5, \"To start\", \"Running\")))","v":"Complete"},0,0,{"$f":"IF(ISBLANK($I11), \"Undefined\", IF(BT12<0.5, \"Complete\",IF(SUMPRODUCT($N$41:BT$41,$N12:BT12)<0.5, \"To start\", \"Running\")))","v":"Complete"},0,0,{"$f":"IF(ISBLANK($I11), \"Undefined\", IF(BW12<0.5, \"Complete\",IF(SUMPRODUCT($N$41:BW$41,$N12:BW12)<0.5, \"To start\", \"Running\")))","v":"Complete"},0,0,{"$f":"IF(ISBLANK($I11), \"Undefined\", IF(BZ12<0.5, \"Complete\",IF(SUMPRODUCT($N$41:BZ$41,$N12:BZ12)<0.5, \"To start\", \"Running\")))","v":"Complete"},0,0,{"$f":"IF(ISBLANK($I11), \"Undefined\", IF(CC12<0.5, \"Complete\",IF(SUMPRODUCT($N$41:CC$41,$N12:CC12)<0.5, \"To start\", \"Running\")))","v":"Complete"},0,0,{"$f":"IF(ISBLANK($I11), \"Undefined\", IF(CF12<0.5, \"Complete\",IF(SUMPRODUCT($N$41:CF$41,$N12:CF12)<0.5, \"To start\", \"Running\")))","v":"Complete"},0,0,{"$f":"IF(ISBLANK($I11), \"Undefined\", IF(CI12<0.5, \"Complete\",IF(SUMPRODUCT($N$41:CI$41,$N12:CI12)<0.5, \"To start\", \"Running\")))","v":"Complete"},0,0,{"$f":"IF(ISBLANK($I11), \"Undefined\", IF(CL12<0.5, \"Complete\",IF(SUMPRODUCT($N$41:CL$41,$N12:CL12)<0.5, \"To start\", \"Running\")))","v":"Complete"},0,0,{"$f":"IF(ISBLANK($I11), \"Undefined\", IF(CO12<0.5, \"Complete\",IF(SUMPRODUCT($N$41:CO$41,$N12:CO12)<0.5, \"To start\", \"Running\")))","v":"Complete"},0,0,{"$f":"IF(ISBLANK($I11), \"Undefined\", IF(CR12<0.5, \"Complete\",IF(SUMPRODUCT($N$41:CR$41,$N12:CR12)<0.5, \"To start\", \"Running\")))","v":"Complete"},0,0,{"$f":"IF(ISBLANK($I11), \"Undefined\", IF(CU12<0.5, \"Complete\",IF(SUMPRODUCT($N$41:CU$41,$N12:CU12)<0.5, \"To start\", \"Running\")))","v":"Complete"},0,0,{"$f":"IF(ISBLANK($I11), \"Undefined\", IF(CX12<0.5, \"Complete\",IF(SUMPRODUCT($N$41:CX$41,$N12:CX12)<0.5, \"To start\", \"Running\")))","v":"Complete"},0,0,{"$f":"IF(ISBLANK($I11), \"Undefined\", IF(DA12<0.5, \"Complete\",IF(SUMPRODUCT($N$41:DA$41,$N12:DA12)<0.5, \"To start\", \"Running\")))","v":"Complete"},0,0,{"$f":"IF(ISBLANK($I11), \"Undefined\", IF(DD12<0.5, \"Complete\",IF(SUMPRODUCT($N$41:DD$41,$N12:DD12)<0.5, \"To start\", \"Running\")))","v":"Complete"},0,0,{"$f":"IF(ISBLANK($I11), \"Undefined\", IF(DG12<0.5, \"Complete\",IF(SUMPRODUCT($N$41:DG$41,$N12:DG12)<0.5, \"To start\", \"Running\")))","v":"Complete"},0,0,{"$f":"IF(ISBLANK($I11), \"Undefined\", IF(DJ12<0.5, \"Complete\",IF(SUMPRODUCT($N$41:DJ$41,$N12:DJ12)<0.5, \"To start\", \"Running\")))","v":"Complete"},0,0,{"$f":"IF(ISBLANK($I11), \"Undefined\", IF(DM12<0.5, \"Complete\",IF(SUMPRODUCT($N$41:DM$41,$N12:DM12)<0.5, \"To start\", \"Running\")))","v":"Complete"},0,0,{"$f":"IF(ISBLANK($I11), \"Undefined\", IF(DP12<0.5, \"Complete\",IF(SUMPRODUCT($N$41:DP$41,$N12:DP12)<0.5, \"To start\", \"Running\")))","v":"Complete"},0,0,{"$f":"IF(ISBLANK($I11), \"Undefined\", IF(DS12<0.5, \"Complete\",IF(SUMPRODUCT($N$41:DS$41,$N12:DS12)<0.5, \"To start\", \"Running\")))","v":"Complete"},0,0,{"$f":"IF(ISBLANK($I11), \"Undefined\", IF(DV12<0.5, \"Complete\",IF(SUMPRODUCT($N$41:DV$41,$N12:DV12)<0.5, \"To start\", \"Running\")))","v":"Complete"},0,0,{"$f":"IF(ISBLANK($I11), \"Undefined\", IF(DY12<0.5, \"Complete\",IF(SUMPRODUCT($N$41:DY$41,$N12:DY12)<0.5, \"To start\", \"Running\")))","v":"Complete"},0,0,{"$f":"IF(ISBLANK($I11), \"Undefined\", IF(EB12<0.5, \"Complete\",IF(SUMPRODUCT($N$41:EB$41,$N12:EB12)<0.5, \"To start\", \"Running\")))","v":"Complete"},null,{"$f":"SUMPRODUCT($L$41:DK$41,$L12:DK12)","v":12},1.5,{"$f":"OFFSET($O12,0,(Capacity!$F$2-SprintStart)*3,1,1)","v":0},0,12,1.5,{"v":2,"d":"200%"},8,1]
["Feature","Development",{"$nulls":6},"Mapear Modelo de Reqs. - Modelo de Use Cases","MA",{"$f":"IF(SprintStart>Capacity!$F$2, \"To start\", INDEX(Burndown,ROW(K13)-ROW(K$6),MIN(Capacity!$F$2-SprintStart,29)*3+3))","v":"Complete"},null,4,0,0,{"$f":"IF(ISBLANK($I13), \"Undefined\", IF(O13<0.5, \"Complete\",IF(SUMPRODUCT($N$41:O$41,$N13:O13)<0.5, \"To start\", \"Running\")))","v":"Complete"},0,0,{"$f":"IF(ISBLANK($I13), \"Undefined\", IF(R13<0.5, \"Complete\",IF(SUMPRODUCT($N$41:R$41,$N13:R13)<0.5, \"To start\", \"Running\")))","v":"Complete"},8,0,{"$f":"IF(ISBLANK($I13), \"Undefined\", IF(U13<0.5, \"Complete\",IF(SUMPRODUCT($N$41:U$41,$N13:U13)<0.5, \"To start\", \"Running\")))","v":"Complete"},0,0,{"$f":"IF(ISBLANK($I13), \"Undefined\", IF(X13<0.5, \"Complete\",IF(SUMPRODUCT($N$41:X$41,$N13:X13)<0.5, \"To start\", \"Running\")))","v":"Complete"},0,0,{"$f":"IF(ISBLANK($I13), \"Undefined\", IF(AA13<0.5, \"Complete\",IF(SUMPRODUCT($N$41:AA$41,$N13:AA13)<0.5, \"To start\", \"Running\")))","v":"Complete"},0,0,{"$f":"IF(ISBLANK($I13), \"Undefined\", IF(AD13<0.5, \"Complete\",IF(SUMPRODUCT($N$41:AD$41,$N13:AD13)<0.5, \"To start\", \"Running\")))","v":"Complete"},4,0,{"$f":"IF(ISBLANK($I13), \"Undefined\", IF(AG13<0.5, \"Complete\",IF(SUMPRODUCT($N$41:AG$41,$N13:AG13)<0.5, \"To start\", \"Running\")))","v":"Complete"},0,0,{"$f":"IF(ISBLANK($I13), \"Undefined\", IF(AJ13<0.5, \"Complete\",IF(SUMPRODUCT($N$41:AJ$41,$N13:AJ13)<0.5, \"To start\", \"Running\")))","v":"Complete"},0,0,{"$f":"IF(ISBLANK($I13), \"Undefined\", IF(AM13<0.5, \"Complete\",IF(SUMPRODUCT($N$41:AM$41,$N13:AM13)<0.5, \"To start\", \"Running\")))","v":"Complete"},0,0,{"$f":"IF(ISBLANK($I13), \"Undefined\", IF(AP13<0.5, \"Complete\",IF(SUMPRODUCT($N$41:AP$41,$N13:AP13)<0.5, \"To start\", \"Running\")))","v":"Complete"},0,0,{"$f":"IF(ISBLANK($I13), \"Undefined\", IF(AS13<0.5, \"Complete\",IF(SUMPRODUCT($N$41:AS$41,$N13:AS13)<0.5, \"To start\", \"Running\")))","v":"Complete"},0,0,{"$f":"IF(ISBLANK($I13), \"Undefined\", IF(AV13<0.5, \"Complete\",IF(SUMPRODUCT($N$41:AV$41,$N13:AV13)<0.5, \"To start\", \"Running\")))","v":"Complete"},0,0,{"$f":"IF(ISBLANK($I13), \"Undefined\", IF(AY13<0.5, \"Complete\",IF(SUMPRODUCT($N$41:AY$41,$N13:AY13)<0.5, \"To start\", \"Running\")))","v":"Complete"},0,0,{"$f":"IF(ISBLANK($I13), \"Undefined\", IF(BB13<0.5, \"Complete\",IF(SUMPRODUCT($N$41:BB$41,$N13:BB13)<0.5, \"To start\", \"Running\")))","v":"Complete"},0,0,{"$f":"IF(ISBLANK($I13), \"Undefined\", IF(BE13<0.5, \"Complete\",IF(SUMPRODUCT($N$41:BE$41,$N13:BE13)<0.5, \"To start\", \"Running\")))","v":"Complete"},0,0,{"$f":"IF(ISBLANK($I13), \"Undefined\", IF(BH13<0.5, \"Complete\",IF(SUMPRODUCT($N$41:BH$41,$N13:BH13)<0.5, \"To start\", \"Running\")))","v":"Complete"},0,0,{"$f":"IF(ISBLANK($I13), \"Undefined\", IF(BK13<0.5, \"Complete\",IF(SUMPRODUCT($N$41:BK$41,$N13:BK13)<0.5, \"To start\", \"Running\")))","v":"Complete"},0,0,{"$f":"IF(ISBLANK($I13), \"Undefined\", IF(BN13<0.5, \"Complete\",IF(SUMPRODUCT($N$41:BN$41,$N13:BN13)<0.5, \"To start\", \"Running\")))","v":"Complete"},0,0,{"$f":"IF(ISBLANK($I13), \"Undefined\", IF(BQ13<0.5, \"Complete\",IF(SUMPRODUCT($N$41:BQ$41,$N13:BQ13)<0.5, \"To start\", \"Running\")))","v":"Complete"},0,0,{"$f":"IF(ISBLANK($I13), \"Undefined\", IF(BT13<0.5, \"Complete\",IF(SUMPRODUCT($N$41:BT$41,$N13:BT13)<0.5, \"To start\", \"Running\")))","v":"Complete"},0,0,{"$f":"IF(ISBLANK($I13), \"Undefined\", IF(BW13<0.5, \"Complete\",IF(SUMPRODUCT($N$41:BW$41,$N13:BW13)<0.5, \"To start\", \"Running\")))","v":"Complete"},0,0,{"$f":"IF(ISBLANK($I13), \"Undefined\", IF(BZ13<0.5, \"Complete\",IF(SUMPRODUCT($N$41:BZ$41,$N13:BZ13)<0.5, \"To start\", \"Running\")))","v":"Complete"},0,0,{"$f":"IF(ISBLANK($I13), \"Undefined\", IF(CC13<0.5, \"Complete\",IF(SUMPRODUCT($N$41:CC$41,$N13:CC13)<0.5, \"To start\", \"Running\")))","v":"Complete"},0,0,{"$f":"IF(ISBLANK($I13), \"Undefined\", IF(CF13<0.5, \"Complete\",IF(SUMPRODUCT($N$41:CF$41,$N13:CF13)<0.5, \"To start\", \"Running\")))","v":"Complete"},0,0,{"$f":"IF(ISBLANK($I13), \"Undefined\", IF(CI13<0.5, \"Complete\",IF(SUMPRODUCT($N$41:CI$41,$N13:CI13)<0.5, \"To start\", \"Running\")))","v":"Complete"},0,0,{"$f":"IF(ISBLANK($I13), \"Undefined\", IF(CL13<0.5, \"Complete\",IF(SUMPRODUCT($N$41:CL$41,$N13:CL13)<0.5, \"To start\", \"Running\")))","v":"Complete"},0,0,{"$f":"IF(ISBLANK($I13), \"Undefined\", IF(CO13<0.5, \"Complete\",IF(SUMPRODUCT($N$41:CO$41,$N13:CO13)<0.5, \"To start\", \"Running\")))","v":"Complete"},0,0,{"$f":"IF(ISBLANK($I13), \"Undefined\", IF(CR13<0.5, \"Complete\",IF(SUMPRODUCT($N$41:CR$41,$N13:CR13)<0.5, \"To start\", \"Running\")))","v":"Complete"},0,0,{"$f":"IF(ISBLANK($I13), \"Undefined\", IF(CU13<0.5, \"Complete\",IF(SUMPRODUCT($N$41:CU$41,$N13:CU13)<0.5, \"To start\", \"Running\")))","v":"Complete"},0,0,{"$f":"IF(ISBLANK($I13), \"Undefined\", IF(CX13<0.5, \"Complete\",IF(SUMPRODUCT($N$41:CX$41,$N13:CX13)<0.5, \"To start\", \"Running\")))","v":"Complete"},0,0,{"$f":"IF(ISBLANK($I13), \"Undefined\", IF(DA13<0.5, \"Complete\",IF(SUMPRODUCT($N$41:DA$41,$N13:DA13)<0.5, \"To start\", \"Running\")))","v":"Complete"},0,0,{"$f":"IF(ISBLANK($I13), \"Undefined\", IF(DD13<0.5, \"Complete\",IF(SUMPRODUCT($N$41:DD$41,$N13:DD13)<0.5, \"To start\", \"Running\")))","v":"Complete"},0,0,{"$f":"IF(ISBLANK($I13), \"Undefined\", IF(DG13<0.5, \"Complete\",IF(SUMPRODUCT($N$41:DG$41,$N13:DG13)<0.5, \"To start\", \"Running\")))","v":"Complete"},0,0,{"$f":"IF(ISBLANK($I13), \"Undefined\", IF(DJ13<0.5, \"Complete\",IF(SUMPRODUCT($N$41:DJ$41,$N13:DJ13)<0.5, \"To start\", \"Running\")))","v":"Complete"},0,0,{"$f":"IF(ISBLANK($I13), \"Undefined\", IF(DM13<0.5, \"Complete\",IF(SUMPRODUCT($N$41:DM$41,$N13:DM13)<0.5, \"To start\", \"Running\")))","v":"Complete"},0,0,{"$f":"IF(ISBLANK($I13), \"Undefined\", IF(DP13<0.5, \"Complete\",IF(SUMPRODUCT($N$41:DP$41,$N13:DP13)<0.5, \"To start\", \"Running\")))","v":"Complete"},0,0,{"$f":"IF(ISBLANK($I13), \"Undefined\", IF(DS13<0.5, \"Complete\",IF(SUMPRODUCT($N$41:DS$41,$N13:DS13)<0.5, \"To start\", \"Running\")))","v":"Complete"},0,0,{"$f":"IF(ISBLANK($I13), \"Undefined\", IF(DV13<0.5, \"Complete\",IF(SUMPRODUCT($N$41:DV$41,$N13:DV13)<0.5, \"To start\", \"Running\")))","v":"Complete"},0,0,{"$f":"IF(ISBLANK($I13), \"Undefined\", IF(DY13<0.5, \"Complete\",IF(SUMPRODUCT($N$41:DY$41,$N13:DY13)<0.5, \"To start\", \"Running\")))","v":"Complete"},0,0,{"$f":"IF(ISBLANK($I13), \"Undefined\", IF(EB13<0.5, \"Complete\",IF(SUMPRODUCT($N$41:EB$41,$N13:EB13)<0.5, \"To start\", \"Running\")))","v":"Complete"},null,{"$f":"SUMPRODUCT($L$41:DK$41,$L13:DK13)","v":12},1.5,{"$f":"OFFSET($O13,0,(Capacity!$F$2-SprintStart)*3,1,1)","v":0},0,12,1.5,{"v":2,"d":"200%"},8,1]
["Feature","Development",{"$nulls":6},"Mapear Modelo de Reqs. - Selecionar 6 Uses Cases",null,{"$f":"IF(SprintStart>Capacity!$F$2, \"To start\", INDEX(Burndown,ROW(K14)-ROW(K$6),MIN(Capacity!$F$2-SprintStart,29)*3+3))","v":"Complete"},null,4,0,{"$f":"MAX(M14-N14,0)","v":4},{"$f":"IF(ISBLANK($I14), \"Undefined\", IF(O14<0.5, \"Complete\",IF(SUMPRODUCT($N$41:O$41,$N14:O14)<0.5, \"To start\", \"Running\")))","v":"To start"},0,{"$f":"MAX(O14-Q14,0)","v":4},{"$f":"IF(ISBLANK($I14), \"Undefined\", IF(R14<0.5, \"Complete\",IF(SUMPRODUCT($N$41:R$41,$N14:R14)<0.5, \"To start\", \"Running\")))","v":"To start"},0,{"$f":"MAX(R14-T14,0)","v":4},{"$f":"IF(ISBLANK($I14), \"Undefined\", IF(U14<0.5, \"Complete\",IF(SUMPRODUCT($N$41:U$41,$N14:U14)<0.5, \"To start\", \"Running\")))","v":"To start"},0,{"$f":"MAX(U14-W14,0)","v":4},{"$f":"IF(ISBLANK($I14), \"Undefined\", IF(X14<0.5, \"Complete\",IF(SUMPRODUCT($N$41:X$41,$N14:X14)<0.5, \"To start\", \"Running\")))","v":"To start"},0,{"$f":"MAX(X14-Z14,0)","v":4},{"$f":"IF(ISBLANK($I14), \"Undefined\", IF(AA14<0.5, \"Complete\",IF(SUMPRODUCT($N$41:AA$41,$N14:AA14)<0.5, \"To start\", \"Running\")))","v":"To start"},0,{"$f":"MAX(AA14-AC14,0)","v":4},{"$f":"IF(ISBLANK($I14), \"Undefined\", IF(AD14<0.5, \"Complete\",IF(SUMPRODUCT($N$41:AD$41,$N14:AD14)<0.5, \"To start\", \"Running\")))","v":"To start"},0,{"$f":"MAX(AD14-AF14,0)","v":4},{"$f":"IF(ISBLANK($I14), \"Undefined\", IF(AG14<0.5, \"Complete\",IF(SUMPRODUCT($N$41:AG$41,$N14:AG14)<0.5, \"To start\", \"Running\")))","v":"To start"},4,0,{"$f":"IF(ISBLANK($I14), \"Undefined\", IF(AJ14<0.5, \"Complete\",IF(SUMPRODUCT($N$41:AJ$41,$N14:AJ14)<0.5, \"To start\", \"Running\")))","v":"Complete"},0,{"$f":"MAX(AJ14-AL14,0)","v":0},{"$f":"IF(ISBLANK($I14), \"Undefined\", IF(AM14<0.5, \"Complete\",IF(SUMPRODUCT($N$41:AM$41,$N14:AM14)<0.5, \"To start\", \"Running\")))","v":"Complete"},0,{"$f":"MAX(AM14-AO14,0)","v":0},{"$f":"IF(ISBLANK($I14), \"Undefined\", IF(AP14<0.5, \"Complete\",IF(SUMPRODUCT($N$41:AP$41,$N14:AP14)<0.5, \"To start\", \"Running\")))","v":"Complete"},0,{"$f":"MAX(AP14-AR14,0)","v":0},{"$f":"IF(ISBLANK($I14), \"Undefined\", IF(AS14<0.5, \"Complete\",IF(SUMPRODUCT($N$41:AS$41,$N14:AS14)<0.5, \"To start\", \"Running\")))","v":"Complete"},0,{"$f":"MAX(AS14-AU14,0)","v":0},{"$f":"IF(ISBLANK($I14), \"Undefined\", IF(AV14<0.5, \"Complete\",IF(SUMPRODUCT($N$41:AV$41,$N14:AV14)<0.5, \"To start\", \"Running\")))","v":"Complete"},0,{"$f":"MAX(AV14-AX14,0)","v":0},{"$f":"IF(ISBLANK($I14), \"Undefined\", IF(AY14<0.5, \"Complete\",IF(SUMPRODUCT($N$41:AY$41,$N14:AY14)<0.5, \"To start\", \"Running\")))","v":"Complete"},0,{"$f":"MAX(AY14-BA14,0)","v":0},{"$f":"IF(ISBLANK($I14), \"Undefined\", IF(BB14<0.5, \"Complete\",IF(SUMPRODUCT($N$41:BB$41,$N14:BB14)<0.5, \"To start\", \"Running\")))","v":"Complete"},0,{"$f":"MAX(BB14-BD14,0)","v":0},{"$f":"IF(ISBLANK($I14), \"Undefined\", IF(BE14<0.5, \"Complete\",IF(SUMPRODUCT($N$41:BE$41,$N14:BE14)<0.5, \"To start\", \"Running\")))","v":"Complete"},0,{"$f":"MAX(BE14-BG14,0)","v":0},{"$f":"IF(ISBLANK($I14), \"Undefined\", IF(BH14<0.5, \"Complete\",IF(SUMPRODUCT($N$41:BH$41,$N14:BH14)<0.5, \"To start\", \"Running\")))","v":"Complete"},0,{"$f":"MAX(BH14-BJ14,0)","v":0},{"$f":"IF(ISBLANK($I14), \"Undefined\", IF(BK14<0.5, \"Complete\",IF(SUMPRODUCT($N$41:BK$41,$N14:BK14)<0.5, \"To start\", \"Running\")))","v":"Complete"},0,{"$f":"MAX(BK14-BM14,0)","v":0},{"$f":"IF(ISBLANK($I14), \"Undefined\", IF(BN14<0.5, \"Complete\",IF(SUMPRODUCT($N$41:BN$41,$N14:BN14)<0.5, \"To start\", \"Running\")))","v":"Complete"},0,{"$f":"MAX(BN14-BP14,0)","v":0},{"$f":"IF(ISBLANK($I14), \"Undefined\", IF(BQ14<0.5, \"Complete\",IF(SUMPRODUCT($N$41:BQ$41,$N14:BQ14)<0.5, \"To start\", \"Running\")))","v":"Complete"},0,{"$f":"MAX(BQ14-BS14,0)","v":0},{"$f":"IF(ISBLANK($I14), \"Undefined\", IF(BT14<0.5, \"Complete\",IF(SUMPRODUCT($N$41:BT$41,$N14:BT14)<0.5, \"To start\", \"Running\")))","v":"Complete"},0,{"$f":"MAX(BT14-BV14,0)","v":0},{"$f":"IF(ISBLANK($I14), \"Undefined\", IF(BW14<0.5, \"Complete\",IF(SUMPRODUCT($N$41:BW$41,$N14:BW14)<0.5, \"To start\", \"Running\")))","v":"Complete"},0,{"$f":"MAX(BW14-BY14,0)","v":0},{"$f":"IF(ISBLANK($I14), \"Undefined\", IF(BZ14<0.5, \"Complete\",IF(SUMPRODUCT($N$41:BZ$41,$N14:BZ14)<0.5, \"To start\", \"Running\")))","v":"Complete"},0,{"$f":"MAX(BZ14-CB14,0)","v":0},{"$f":"IF(ISBLANK($I14), \"Undefined\", IF(CC14<0.5, \"Complete\",IF(SUMPRODUCT($N$41:CC$41,$N14:CC14)<0.5, \"To start\", \"Running\")))","v":"Complete"},0,{"$f":"MAX(CC14-CE14,0)","v":0},{"$f":"IF(ISBLANK($I14), \"Undefined\", IF(CF14<0.5, \"Complete\",IF(SUMPRODUCT($N$41:CF$41,$N14:CF14)<0.5, \"To start\", \"Running\")))","v":"Complete"},0,{"$f":"MAX(CF14-CH14,0)","v":0},{"$f":"IF(ISBLANK($I14), \"Undefined\", IF(CI14<0.5, \"Complete\",IF(SUMPRODUCT($N$41:CI$41,$N14:CI14)<0.5, \"To start\", \"Running\")))","v":"Complete"},0,{"$f":"MAX(CI14-CK14,0)","v":0},{"$f":"IF(ISBLANK($I14), \"Undefined\", IF(CL14<0.5, \"Complete\",IF(SUMPRODUCT($N$41:CL$41,$N14:CL14)<0.5, \"To start\", \"Running\")))","v":"Complete"},0,{"$f":"MAX(CL14-CN14,0)","v":0},{"$f":"IF(ISBLANK($I14), \"Undefined\", IF(CO14<0.5, \"Complete\",IF(SUMPRODUCT($N$41:CO$41,$N14:CO14)<0.5, \"To start\", \"Running\")))","v":"Complete"},0,{"$f":"MAX(CO14-CQ14,0)","v":0},{"$f":"IF(ISBLANK($I14), \"Undefined\", IF(CR14<0.5, \"Complete\",IF(SUMPRODUCT($N$41:CR$41,$N14:CR14)<0.5, \"To start\", \"Running\")))","v":"Complete"},0,{"$f":"MAX(CR14-CT14,0)","v":0},{"$f":"IF(ISBLANK($I14), \"Undefined\", IF(CU14<0.5, \"Complete\",IF(SUMPRODUCT($N$41:CU$41,$N14:CU14)<0.5, \"To start\", \"Running\")))","v":"Complete"},0,{"$f":"MAX(CU14-CW14,0)","v":0},{"$f":"IF(ISBLANK($I14), \"Undefined\", IF(CX14<0.5, \"Complete\",IF(SUMPRODUCT($N$41:CX$41,$N14:CX14)<0.5, \"To start\", \"Running\")))","v":"Complete"},0,{"$f":"MAX(CX14-CZ14,0)","v":0},{"$f":"IF(ISBLANK($I14), \"Undefined\", IF(DA14<0.5, \"Complete\",IF(SUMPRODUCT($N$41:DA$41,$N14:DA14)<0.5, \"To start\", \"Running\")))","v":"Complete"},0,{"$f":"MAX(DA14-DC14,0)","v":0},{"$f":"IF(ISBLANK($I14), \"Undefined\", IF(DD14<0.5, \"Complete\",IF(SUMPRODUCT($N$41:DD$41,$N14:DD14)<0.5, \"To start\", \"Running\")))","v":"Complete"},0,{"$f":"MAX(DD14-DF14,0)","v":0},{"$f":"IF(ISBLANK($I14), \"Undefined\", IF(DG14<0.5, \"Complete\",IF(SUMPRODUCT($N$41:DG$41,$N14:DG14)<0.5, \"To start\", \"Running\")))","v":"Complete"},0,{"$f":"MAX(DG14-DI14,0)","v":0},{"$f":"IF(ISBLANK($I14), \"Undefined\", IF(DJ14<0.5, \"Complete\",IF(SUMPRODUCT($N$41:DJ$41,$N14:DJ14)<0.5, \"To start\", \"Running\")))","v":"Complete"},0,{"$f":"MAX(DJ14-DL14,0)","v":0},{"$f":"IF(ISBLANK($I14), \"Undefined\", IF(DM14<0.5, \"Complete\",IF(SUMPRODUCT($N$41:DM$41,$N14:DM14)<0.5, \"To start\", \"Running\")))","v":"Complete"},0,{"$f":"MAX(DM14-DO14,0)","v":0},{"$f":"IF(ISBLANK($I14), \"Undefined\", IF(DP14<0.5, \"Complete\",IF(SUMPRODUCT($N$41:DP$41,$N14:DP14)<0.5, \"To start\", \"Running\")))","v":"Complete"},0,{"$f":"MAX(DP14-DR14,0)","v":0},{"$f":"IF(ISBLANK($I14), \"Undefined\", IF(DS14<0.5, \"Complete\",IF(SUMPRODUCT($N$41:DS$41,$N14:DS14)<0.5, \"To start\", \"Running\")))","v":"Complete"},0,{"$f":"MAX(DS14-DU14,0)","v":0},{"$f":"IF(ISBLANK($I14), \"Undefined\", IF(DV14<0.5, \"Complete\",IF(SUMPRODUCT($N$41:DV$41,$N14:DV14)<0.5, \"To start\", \"Running\")))","v":"Complete"},0,{"$f":"MAX(DV14-DX14,0)","v":0},{"$f":"IF(ISBLANK($I14), \"Undefined\", IF(DY14<0.5, \"Complete\",IF(SUMPRODUCT($N$41:DY$41,$N14:DY14)<0.5, \"To start\", \"Running\")))","v":"Complete"},0,{"$f":"MAX(DY14-EA14,0)","v":0},{"$f":"IF(ISBLANK($I14), \"Undefined\", IF(EB14<0.5, \"Complete\",IF(SUMPRODUCT($N$41:EB$41,$N14:EB14)<0.5, \"To start\", \"Running\")))","v":"Complete"},null,{"$f":"SUMPRODUCT($L$41:DK$41,$L14:DK14)","v":4},0.5,{"$f":"OFFSET($O14,0,(Capacity!$F$2-SprintStart)*3,1,1)","v":0},0,4,0.5,{"v":0,"d":"0%"},0,0]
["Feature","Development",{"$nulls":6},"Mapear Modelo de Reqs. -Definir uma User Story para Use Cases",null,{"$f":"IF(SprintStart>Capacity!$F$2, \"To start\", INDEX(Burndown,ROW(K15)-ROW(K$6),MIN(Capacity!$F$2-SprintStart,29)*3+3))","v":"Complete"},null,2,0,{"$f":"MAX(M15-N15,0)","v":2},{"$f":"IF(ISBLANK($I15), \"Undefined\", IF(O15<0.5, \"Complete\",IF(SUMPRODUCT($N$41:O$41,$N15:O15)<0.5, \"To start\", \"Running\")))","v":"To start"},0,{"$f":"MAX(O15-Q15,0)","v":2},{"$f":"IF(ISBLANK($I15), \"Undefined\", IF(R15<0.5, \"Complete\",IF(SUMPRODUCT($N$41:R$41,$N15:R15)<0.5, \"To start\", \"Running\")))","v":"To start"},0,{"$f":"MAX(R15-T15,0)","v":2},{"$f":"IF(ISBLANK($I15), \"Undefined\", IF(U15<0.5, \"Complete\",IF(SUMPRODUCT($N$41:U$41,$N15:U15)<0.5, \"To start\", \"Running\")))","v":"To start"},0,{"$f":"MAX(U15-W15,0)","v":2},{"$f":"IF(ISBLANK($I15), \"Undefined\", IF(X15<0.5, \"Complete\",IF(SUMPRODUCT($N$41:X$41,$N15:X15)<0.5, \"To start\", \"Running\")))","v":"To start"},0,{"$f":"MAX(X15-Z15,0)","v":2},{"$f":"IF(ISBLANK($I15), \"Undefined\", IF(AA15<0.5, \"Complete\",IF(SUMPRODUCT($N$41:AA$41,$N15:AA15)<0.5, \"To start\", \"Running\")))","v":"To start"},0,{"$f":"MAX(AA15-AC15,0)","v":2},{"$f":"IF(ISBLANK($I15), \"Undefined\", IF(AD15<0.5, \"Complete\",IF(SUMPRODUCT($N$41:AD$41,$N15:AD15)<0.5, \"To start\", \"Running\")))","v":"To start"},0,{"$f":"MAX(AD15-AF15,0)","v":2},{"$f":"IF(ISBLANK($I15), \"Undefined\", IF(AG15<0.5, \"Complete\",IF(SUMPRODUCT($N$41:AG$41,$N15:AG15)<0.5, \"To start\", \"Running\")))","v":"To start"},2,0,{"$f":"IF(ISBLANK($I15), \"Undefined\", IF(AJ15<0.5, \"Complete\",IF(SUMPRODUCT($N$41:AJ$41,$N15:AJ15)<0.5, \"To start\", \"Running\")))","v":"Complete"},0,{"$f":"MAX(AJ15-AL15,0)","v":0},{"$f":"IF(ISBLANK($I15), \"Undefined\", IF(AM15<0.5, \"Complete\",IF(SUMPRODUCT($N$41:AM$41,$N15:AM15)<0.5, \"To start\", \"Running\")))","v":"Complete"},0,{"$f":"MAX(AM15-AO15,0)","v":0},{"$f":"IF(ISBLANK($I15), \"Undefined\", IF(AP15<0.5, \"Complete\",IF(SUMPRODUCT($N$41:AP$41,$N15:AP15)<0.5, \"To start\", \"Running\")))","v":"Complete"},0,{"$f":"MAX(AP15-AR15,0)","v":0},{"$f":"IF(ISBLANK($I15), \"Undefined\", IF(AS15<0.5, \"Complete\",IF(SUMPRODUCT($N$41:AS$41,$N15:AS15)<0.5, \"To start\", \"Running\")))","v":"Complete"},0,{"$f":"MAX(AS15-AU15,0)","v":0},{"$f":"IF(ISBLANK($I15), \"Undefined\", IF(AV15<0.5, \"Complete\",IF(SUMPRODUCT($N$41:AV$41,$N15:AV15)<0.5, \"To start\", \"Running\")))","v":"Complete"},0,{"$f":"MAX(AV15-AX15,0)","v":0},{"$f":"IF(ISBLANK($I15), \"Undefined\", IF(AY15<0.5, \"Complete\",IF(SUMPRODUCT($N$41:AY$41,$N15:AY15)<0.5, \"To start\", \"Running\")))","v":"Complete"},0,{"$f":"MAX(AY15-BA15,0)","v":0},{"$f":"IF(ISBLANK($I15), \"Undefined\", IF(BB15<0.5, \"Complete\",IF(SUMPRODUCT($N$41:BB$41,$N15:BB15)<0.5, \"To start\", \"Running\")))","v":"Complete"},0,{"$f":"MAX(BB15-BD15,0)","v":0},{"$f":"IF(ISBLANK($I15), \"Undefined\", IF(BE15<0.5, \"Complete\",IF(SUMPRODUCT($N$41:BE$41,$N15:BE15)<0.5, \"To start\", \"Running\")))","v":"Complete"},0,{"$f":"MAX(BE15-BG15,0)","v":0},{"$f":"IF(ISBLANK($I15), \"Undefined\", IF(BH15<0.5, \"Complete\",IF(SUMPRODUCT($N$41:BH$41,$N15:BH15)<0.5, \"To start\", \"Running\")))","v":"Complete"},0,{"$f":"MAX(BH15-BJ15,0)","v":0},{"$f":"IF(ISBLANK($I15), \"Undefined\", IF(BK15<0.5, \"Complete\",IF(SUMPRODUCT($N$41:BK$41,$N15:BK15)<0.5, \"To start\", \"Running\")))","v":"Complete"},0,{"$f":"MAX(BK15-BM15,0)","v":0},{"$f":"IF(ISBLANK($I15), \"Undefined\", IF(BN15<0.5, \"Complete\",IF(SUMPRODUCT($N$41:BN$41,$N15:BN15)<0.5, \"To start\", \"Running\")))","v":"Complete"},0,{"$f":"MAX(BN15-BP15,0)","v":0},{"$f":"IF(ISBLANK($I15), \"Undefined\", IF(BQ15<0.5, \"Complete\",IF(SUMPRODUCT($N$41:BQ$41,$N15:BQ15)<0.5, \"To start\", \"Running\")))","v":"Complete"},0,{"$f":"MAX(BQ15-BS15,0)","v":0},{"$f":"IF(ISBLANK($I15), \"Undefined\", IF(BT15<0.5, \"Complete\",IF(SUMPRODUCT($N$41:BT$41,$N15:BT15)<0.5, \"To start\", \"Running\")))","v":"Complete"},0,{"$f":"MAX(BT15-BV15,0)","v":0},{"$f":"IF(ISBLANK($I15), \"Undefined\", IF(BW15<0.5, \"Complete\",IF(SUMPRODUCT($N$41:BW$41,$N15:BW15)<0.5, \"To start\", \"Running\")))","v":"Complete"},0,{"$f":"MAX(BW15-BY15,0)","v":0},{"$f":"IF(ISBLANK($I15), \"Undefined\", IF(BZ15<0.5, \"Complete\",IF(SUMPRODUCT($N$41:BZ$41,$N15:BZ15)<0.5, \"To start\", \"Running\")))","v":"Complete"},0,{"$f":"MAX(BZ15-CB15,0)","v":0},{"$f":"IF(ISBLANK($I15), \"Undefined\", IF(CC15<0.5, \"Complete\",IF(SUMPRODUCT($N$41:CC$41,$N15:CC15)<0.5, \"To start\", \"Running\")))","v":"Complete"},0,{"$f":"MAX(CC15-CE15,0)","v":0},{"$f":"IF(ISBLANK($I15), \"Undefined\", IF(CF15<0.5, \"Complete\",IF(SUMPRODUCT($N$41:CF$41,$N15:CF15)<0.5, \"To start\", \"Running\")))","v":"Complete"},0,{"$f":"MAX(CF15-CH15,0)","v":0},{"$f":"IF(ISBLANK($I15), \"Undefined\", IF(CI15<0.5, \"Complete\",IF(SUMPRODUCT($N$41:CI$41,$N15:CI15)<0.5, \"To start\", \"Running\")))","v":"Complete"},0,{"$f":"MAX(CI15-CK15,0)","v":0},{"$f":"IF(ISBLANK($I15), \"Undefined\", IF(CL15<0.5, \"Complete\",IF(SUMPRODUCT($N$41:CL$41,$N15:CL15)<0.5, \"To start\", \"Running\")))","v":"Complete"},0,{"$f":"MAX(CL15-CN15,0)","v":0},{"$f":"IF(ISBLANK($I15), \"Undefined\", IF(CO15<0.5, \"Complete\",IF(SUMPRODUCT($N$41:CO$41,$N15:CO15)<0.5, \"To start\", \"Running\")))","v":"Complete"},0,{"$f":"MAX(CO15-CQ15,0)","v":0},{"$f":"IF(ISBLANK($I15), \"Undefined\", IF(CR15<0.5, \"Complete\",IF(SUMPRODUCT($N$41:CR$41,$N15:CR15)<0.5, \"To start\", \"Running\")))","v":"Complete"},0,{"$f":"MAX(CR15-CT15,0)","v":0},{"$f":"IF(ISBLANK($I15), \"Undefined\", IF(CU15<0.5, \"Complete\",IF(SUMPRODUCT($N$41:CU$41,$N15:CU15)<0.5, \"To start\", \"Running\")))","v":"Complete"},0,{"$f":"MAX(CU15-CW15,0)","v":0},{"$f":"IF(ISBLANK($I15), \"Undefined\", IF(CX15<0.5, \"Complete\",IF(SUMPRODUCT($N$41:CX$41,$N15:CX15)<0.5, \"To start\", \"Running\")))","v":"Complete"},0,{"$f":"MAX(CX15-CZ15,0)","v":0},{"$f":"IF(ISBLANK($I15), \"Undefined\", IF(DA15<0.5, \"Complete\",IF(SUMPRODUCT($N$41:DA$41,$N15:DA15)<0.5, \"To start\", \"Running\")))","v":"Complete"},0,{"$f":"MAX(DA15-DC15,0)","v":0},{"$f":"IF(ISBLANK($I15), \"Undefined\", IF(DD15<0.5, \"Complete\",IF(SUMPRODUCT($N$41:DD$41,$N15:DD15)<0.5, \"To start\", \"Running\")))","v":"Complete"},0,{"$f":"MAX(DD15-DF15,0)","v":0},{"$f":"IF(ISBLANK($I15), \"Undefined\", IF(DG15<0.5, \"Complete\",IF(SUMPRODUCT($N$41:DG$41,$N15:DG15)<0.5, \"To start\", \"Running\")))","v":"Complete"},0,{"$f":"MAX(DG15-DI15,0)","v":0},{"$f":"IF(ISBLANK($I15), \"Undefined\", IF(DJ15<0.5, \"Complete\",IF(SUMPRODUCT($N$41:DJ$41,$N15:DJ15)<0.5, \"To start\", \"Running\")))","v":"Complete"},0,{"$f":"MAX(DJ15-DL15,0)","v":0},{"$f":"IF(ISBLANK($I15), \"Undefined\", IF(DM15<0.5, \"Complete\",IF(SUMPRODUCT($N$41:DM$41,$N15:DM15)<0.5, \"To start\", \"Running\")))","v":"Complete"},0,{"$f":"MAX(DM15-DO15,0)","v":0},{"$f":"IF(ISBLANK($I15), \"Undefined\", IF(DP15<0.5, \"Complete\",IF(SUMPRODUCT($N$41:DP$41,$N15:DP15)<0.5, \"To start\", \"Running\")))","v":"Complete"},0,{"$f":"MAX(DP15-DR15,0)","v":0},{"$f":"IF(ISBLANK($I15), \"Undefined\", IF(DS15<0.5, \"Complete\",IF(SUMPRODUCT($N$41:DS$41,$N15:DS15)<0.5, \"To start\", \"Running\")))","v":"Complete"},0,{"$f":"MAX(DS15-DU15,0)","v":0},{"$f":"IF(ISBLANK($I15), \"Undefined\", IF(DV15<0.5, \"Complete\",IF(SUMPRODUCT($N$41:DV$41,$N15:DV15)<0.5, \"To start\", \"Running\")))","v":"Complete"},0,{"$f":"MAX(DV15-DX15,0)","v":0},{"$f":"IF(ISBLANK($I15), \"Undefined\", IF(DY15<0.5, \"Complete\",IF(SUMPRODUCT($N$41:DY$41,$N15:DY15)<0.5, \"To start\", \"Running\")))","v":"Complete"},0,{"$f":"MAX(DY15-EA15,0)","v":0},{"$f":"IF(ISBLANK($I15), \"Undefined\", IF(EB15<0.5, \"Complete\",IF(SUMPRODUCT($N$41:EB$41,$N15:EB15)<0.5, \"To start\", \"Running\")))","v":"Complete"},null,{"$f":"SUMPRODUCT($L$41:DK$41,$L15:DK15)","v":2},0.25,{"$f":"OFFSET($O15,0,(Capacity!$F$2-SprintStart)*3,1,1)","v":0},0,2,0.25,{"v":0,"d":"0%"},0,0]
["Feature","Development",{"$nulls":6},"Mapear Modelo de Reqs. -Diagrama de classes",null,{"$f":"IF(SprintStart>Capacity!$F$2, \"To start\", INDEX(Burndown,ROW(K16)-ROW(K$6),MIN(Capacity!$F$2-SprintStart,29)*3+3))","v":"Complete"},null,2,0,2,{"$f":"IF(ISBLANK($I16), \"Undefined\", IF(O16<0.5, \"Complete\",IF(SUMPRODUCT($N$41:O$41,$N16:O16)<0.5, \"To start\", \"Running\")))","v":"To start"},0,2,{"$f":"IF(ISBLANK($I16), \"Undefined\", IF(R16<0.5, \"Complete\",IF(SUMPRODUCT($N$41:R$41,$N16:R16)<0.5, \"To start\", \"Running\")))","v":"To start"},0,2,{"$f":"IF(ISBLANK($I16), \"Undefined\", IF(U16<0.5, \"Complete\",IF(SUMPRODUCT($N$41:U$41,$N16:U16)<0.5, \"To start\", \"Running\")))","v":"To start"},0,2,{"$f":"IF(ISBLANK($I16), \"Undefined\", IF(X16<0.5, \"Complete\",IF(SUMPRODUCT($N$41:X$41,$N16:X16)<0.5, \"To start\", \"Running\")))","v":"To start"},0,2,{"$f":"IF(ISBLANK($I16), \"Undefined\", IF(AA16<0.5, \"Complete\",IF(SUMPRODUCT($N$41:AA$41,$N16:AA16)<0.5, \"To start\", \"Running\")))","v":"To start"},0,2,{"$f":"IF(ISBLANK($I16), \"Undefined\", IF(AD16<0.5, \"Complete\",IF(SUMPRODUCT($N$41:AD$41,$N16:AD16)<0.5, \"To start\", \"Running\")))","v":"To start"},0,2,{"$f":"IF(ISBLANK($I16), \"Undefined\", IF(AG16<0.5, \"Complete\",IF(SUMPRODUCT($N$41:AG$41,$N16:AG16)<0.5, \"To start\", \"Running\")))","v":"To start"},0,{"$f":"MAX(AG16-AI16,0)","v":2},{"$f":"IF(ISBLANK($I16), \"Undefined\", IF(AJ16<0.5, \"Complete\",IF(SUMPRODUCT($N$41:AJ$41,$N16:AJ16)<0.5, \"To start\", \"Running\")))","v":"To start"},0,2,{"$f":"IF(ISBLANK($I16), \"Undefined\", IF(AM16<0.5, \"Complete\",IF(SUMPRODUCT($N$41:AM$41,$N16:AM16)<0.5, \"To start\", \"Running\")))","v":"To start"},2,0,{"$f":"IF(ISBLANK($I16), \"Undefined\", IF(AP16<0.5, \"Complete\",IF(SUMPRODUCT($N$41:AP$41,$N16:AP16)<0.5, \"To start\", \"Running\")))","v":"Complete"},0,0,{"$f":"IF(ISBLANK($I16), \"Undefined\", IF(AS16<0.5, \"Complete\",IF(SUMPRODUCT($N$41:AS$41,$N16:AS16)<0.5, \"To start\", \"Running\")))","v":"Complete"},0,0,{"$f":"IF(ISBLANK($I16), \"Undefined\", IF(AV16<0.5, \"Complete\",IF(SUMPRODUCT($N$41:AV$41,$N16:AV16)<0.5, \"To start\", \"Running\")))","v":"Complete"},0,0,{"$f":"IF(ISBLANK($I16), \"Undefined\", IF(AY16<0.5, \"Complete\",IF(SUMPRODUCT($N$41:AY$41,$N16:AY16)<0.5, \"To start\", \"Running\")))","v":"Complete"},0,0,{"$f":"IF(ISBLANK($I16), \"Undefined\", IF(BB16<0.5, \"Complete\",IF(SUMPRODUCT($N$41:BB$41,$N16:BB16)<0.5, \"To start\", \"Running\")))","v":"Complete"},0,0,{"$f":"IF(ISBLANK($I16), \"Undefined\", IF(BE16<0.5, \"Complete\",IF(SUMPRODUCT($N$41:BE$41,$N16:BE16)<0.5, \"To start\", \"Running\")))","v":"Complete"},0,0,{"$f":"IF(ISBLANK($I16), \"Undefined\", IF(BH16<0.5, \"Complete\",IF(SUMPRODUCT($N$41:BH$41,$N16:BH16)<0.5, \"To start\", \"Running\")))","v":"Complete"},0,0,{"$f":"IF(ISBLANK($I16), \"Undefined\", IF(BK16<0.5, \"Complete\",IF(SUMPRODUCT($N$41:BK$41,$N16:BK16)<0.5, \"To start\", \"Running\")))","v":"Complete"},0,0,{"$f":"IF(ISBLANK($I16), \"Undefined\", IF(BN16<0.5, \"Complete\",IF(SUMPRODUCT($N$41:BN$41,$N16:BN16)<0.5, \"To start\", \"Running\")))","v":"Complete"},0,0,{"$f":"IF(ISBLANK($I16), \"Undefined\", IF(BQ16<0.5, \"Complete\",IF(SUMPRODUCT($N$41:BQ$41,$N16:BQ16)<0.5, \"To start\", \"Running\")))","v":"Complete"},0,0,{"$f":"IF(ISBLANK($I16), \"Undefined\", IF(BT16<0.5, \"Complete\",IF(SUMPRODUCT($N$41:BT$41,$N16:BT16)<0.5, \"To start\", \"Running\")))","v":"Complete"},0,0,{"$f":"IF(ISBLANK($I16), \"Undefined\", IF(BW16<0.5, \"Complete\",IF(SUMPRODUCT($N$41:BW$41,$N16:BW16)<0.5, \"To start\", \"Running\")))","v":"Complete"},0,0,{"$f":"IF(ISBLANK($I16), \"Undefined\", IF(BZ16<0.5, \"Complete\",IF(SUMPRODUCT($N$41:BZ$41,$N16:BZ16)<0.5, \"To start\", \"Running\")))","v":"Complete"},0,0,{"$f":"IF(ISBLANK($I16), \"Undefined\", IF(CC16<0.5, \"Complete\",IF(SUMPRODUCT($N$41:CC$41,$N16:CC16)<0.5, \"To start\", \"Running\")))","v":"Complete"},0,0,{"$f":"IF(ISBLANK($I16), \"Undefined\", IF(CF16<0.5, \"Complete\",IF(SUMPRODUCT($N$41:CF$41,$N16:CF16)<0.5, \"To start\", \"Running\")))","v":"Complete"},0,0,{"$f":"IF(ISBLANK($I16), \"Undefined\", IF(CI16<0.5, \"Complete\",IF(SUMPRODUCT($N$41:CI$41,$N16:CI16)<0.5, \"To start\", \"Running\")))","v":"Complete"},0,0,{"$f":"IF(ISBLANK($I16), \"Undefined\", IF(CL16<0.5, \"Complete\",IF(SUMPRODUCT($N$41:CL$41,$N16:CL16)<0.5, \"To start\", \"Running\")))","v":"Complete"},0,0,{"$f":"IF(ISBLANK($I16), \"Undefined\", IF(CO16<0.5, \"Complete\",IF(SUMPRODUCT($N$41:CO$41,$N16:CO16)<0.5, \"To start\", \"Running\")))","v":"Complete"},0,0,{"$f":"IF(ISBLANK($I16), \"Undefined\", IF(CR16<0.5, \"Complete\",IF(SUMPRODUCT($N$41:CR$41,$N16:CR16)<0.5, \"To start\", \"Running\")))","v":"Complete"},0,0,{"$f":"IF(ISBLANK($I16), \"Undefined\", IF(CU16<0.5, \"Complete\",IF(SUMPRODUCT($N$41:CU$41,$N16:CU16)<0.5, \"To start\", \"Running\")))","v":"Complete"},0,0,{"$f":"IF(ISBLANK($I16), \"Undefined\", IF(CX16<0.5, \"Complete\",IF(SUMPRODUCT($N$41:CX$41,$N16:CX16)<0.5, \"To start\", \"Running\")))","v":"Complete"},0,0,{"$f":"IF(ISBLANK($I16), \"Undefined\", IF(DA16<0.5, \"Complete\",IF(SUMPRODUCT($N$41:DA$41,$N16:DA16)<0.5, \"To start\", \"Running\")))","v":"Complete"},0,0,{"$f":"IF(ISBLANK($I16), \"Undefined\", IF(DD16<0.5, \"Complete\",IF(SUMPRODUCT($N$41:DD$41,$N16:DD16)<0.5, \"To start\", \"Running\")))","v":"Complete"},0,0,{"$f":"IF(ISBLANK($I16), \"Undefined\", IF(DG16<0.5, \"Complete\",IF(SUMPRODUCT($N$41:DG$41,$N16:DG16)<0.5, \"To start\", \"Running\")))","v":"Complete"},0,0,{"$f":"IF(ISBLANK($I16), \"Undefined\", IF(DJ16<0.5, \"Complete\",IF(SUMPRODUCT($N$41:DJ$41,$N16:DJ16)<0.5, \"To start\", \"Running\")))","v":"Complete"},0,0,{"$f":"IF(ISBLANK($I16), \"Undefined\", IF(DM16<0.5, \"Complete\",IF(SUMPRODUCT($N$41:DM$41,$N16:DM16)<0.5, \"To start\", \"Running\")))","v":"Complete"},0,0,{"$f":"IF(ISBLANK($I16), \"Undefined\", IF(DP16<0.5, \"Complete\",IF(SUMPRODUCT($N$41:DP$41,$N16:DP16)<0.5, \"To start\", \"Running\")))","v":"Complete"},0,0,{"$f":"IF(ISBLANK($I16), \"Undefined\", IF(DS16<0.5, \"Complete\",IF(SUMPRODUCT($N$41:DS$41,$N16:DS16)<0.5, \"To start\", \"Running\")))","v":"Complete"},0,0,{"$f":"IF(ISBLANK($I16), \"Undefined\", IF(DV16<0.5, \"Complete\",IF(SUMPRODUCT($N$41:DV$41,$N16:DV16)<0.5, \"To start\", \"Running\")))","v":"Complete"},0,0,{"$f":"IF(ISBLANK($I16), \"Undefined\", IF(DY16<0.5, \"Complete\",IF(SUMPRODUCT($N$41:DY$41,$N16:DY16)<0.5, \"To start\", \"Running\")))","v":"Complete"},0,0,{"$f":"IF(ISBLANK($I16), \"Undefined\", IF(EB16<0.5, \"Complete\",IF(SUMPRODUCT($N$41:EB$41,$N16:EB16)<0.5, \"To start\", \"Running\")))","v":"Complete"},null,{"$f":"SUMPRODUCT($L$41:DK$41,$L16:DK16)","v":2},0.25,{"$f":"OFFSET($O16,0,(Capacity!$F$2-SprintStart)*3,1,1)","v":0},0,2,0.25,{"v":0,"d":"0%"},0,0]
[{"$nulls":10},{"$f":"IF(SprintStart>Capacity!$F$2, \"To start\", INDEX(Burndown,ROW(K17)-ROW(K$6),MIN(Capacity!$F$2-SprintStart,29)*3+3))","v":"Undefined"},null,0,0,0,{"$f":"IF(ISBLANK($I17), \"Undefined\", IF(O17<0.5, \"Complete\",IF(SUMPRODUCT($N$41:O$41,$N17:O17)<0.5, \"To start\", \"Running\")))","v":"Undefined"},0,0,{"$f":"IF(ISBLANK($I17), \"Undefined\", IF(R17<0.5, \"Complete\",IF(SUMPRODUCT($N$41:R$41,$N17:R17)<0.5, \"To start\", \"Running\")))","v":"Undefined"},0,0,{"$f":"IF(ISBLANK($I17), \"Undefined\", IF(U17<0.5, \"Complete\",IF(SUMPRODUCT($N$41:U$41,$N17:U17)<0.5, \"To start\", \"Running\")))","v":"Undefined"},0,0,{"$f":"IF(ISBLANK($I17), \"Undefined\", IF(X17<0.5, \"Complete\",IF(SUMPRODUCT($N$41:X$41,$N17:X17)<0.5, \"To start\", \"Running\")))","v":"Undefined"},0,0,{"$f":"IF(ISBLANK($I17), \"Undefined\", IF(AA17<0.5, \"Complete\",IF(SUMPRODUCT($N$41:AA$41,$N17:AA17)<0.5, \"To start\", \"Running\")))","v":"Undefined"},0,0,{"$f":"IF(ISBLANK($I17), \"Undefined\", IF(AD17<0.5, \"Complete\",IF(SUMPRODUCT($N$41:AD$41,$N17:AD17)<0.5, \"To start\", \"Running\")))","v":"Undefined"},0,0,{"$f":"IF(ISBLANK($I17), \"Undefined\", IF(AG17<0.5, \"Complete\",IF(SUMPRODUCT($N$41:AG$41,$N17:AG17)<0.5, \"To start\", \"Running\")))","v":"Undefined"},0,0,{"$f":"IF(ISBLANK($I17), \"Undefined\", IF(AJ17<0.5, \"Complete\",IF(SUMPRODUCT($N$41:AJ$41,$N17:AJ17)<0.5, \"To start\", \"Running\")))","v":"Undefined"},0,0,{"$f":"IF(ISBLANK($I17), \"Undefined\", IF(AM17<0.5, \"Complete\",IF(SUMPRODUCT($N$41:AM$41,$N17:AM17)<0.5, \"To start\", \"Running\")))","v":"Undefined"},0,0,{"$f":"IF(ISBLANK($I17), \"Undefined\", IF(AP17<0.5, \"Complete\",IF(SUMPRODUCT($N$41:AP$41,$N17:AP17)<0.5, \"To start\", \"Running\")))","v":"Undefined"},0,0,{"$f":"IF(ISBLANK($I17), \"Undefined\", IF(AS17<0.5, \"Complete\",IF(SUMPRODUCT($N$41:AS$41,$N17:AS17)<0.5, \"To start\", \"Running\")))","v":"Undefined"},0,0,{"$f":"IF(ISBLANK($I17), \"Undefined\", IF(AV17<0.5, \"Complete\",IF(SUMPRODUCT($N$41:AV$41,$N17:AV17)<0.5, \"To start\", \"Running\")))","v":"Undefined"},0,0,{"$f":"IF(ISBLANK($I17), \"Undefined\", IF(AY17<0.5, \"Complete\",IF(SUMPRODUCT($N$41:AY$41,$N17:AY17)<0.5, \"To start\", \"Running\")))","v":"Undefined"},0,0,{"$f":"IF(ISBLANK($I17), \"Undefined\", IF(BB17<0.5, \"Complete\",IF(SUMPRODUCT($N$41:BB$41,$N17:BB17)<0.5, \"To start\", \"Running\")))","v":"Undefined"},0,0,{"$f":"IF(ISBLANK($I17), \"Undefined\", IF(BE17<0.5, \"Complete\",IF(SUMPRODUCT($N$41:BE$41,$N17:BE17)<0.5, \"To start\", \"Running\")))","v":"Undefined"},0,0,{"$f":"IF(ISBLANK($I17), \"Undefined\", IF(BH17<0.5, \"Complete\",IF(SUMPRODUCT($N$41:BH$41,$N17:BH17)<0.5, \"To start\", \"Running\")))","v":"Undefined"},0,0,{"$f":"IF(ISBLANK($I17), \"Undefined\", IF(BK17<0.5, \"Complete\",IF(SUMPRODUCT($N$41:BK$41,$N17:BK17)<0.5, \"To start\", \"Running\")))","v":"Undefined"},0,0,{"$f":"IF(ISBLANK($I17), \"Undefined\", IF(BN17<0.5, \"Complete\",IF(SUMPRODUCT($N$41:BN$41,$N17:BN17)<0.5, \"To start\", \"Running\")))","v":"Undefined"},0,0,{"$f":"IF(ISBLANK($I17), \"Undefined\", IF(BQ17<0.5, \"Complete\",IF(SUMPRODUCT($N$41:BQ$41,$N17:BQ17)<0.5, \"To start\", \"Running\")))","v":"Undefined"},0,0,{"$f":"IF(ISBLANK($I17), \"Undefined\", IF(BT17<0.5, \"Complete\",IF(SUMPRODUCT($N$41:BT$41,$N17:BT17)<0.5, \"To start\", \"Running\")))","v":"Undefined"},0,0,{"$f":"IF(ISBLANK($I17), \"Undefined\", IF(BW17<0.5, \"Complete\",IF(SUMPRODUCT($N$41:BW$41,$N17:BW17)<0.5, \"To start\", \"Running\")))","v":"Undefined"},0,0,{"$f":"IF(ISBLANK($I17), \"Undefined\", IF(BZ17<0.5, \"Complete\",IF(SUMPRODUCT($N$41:BZ$41,$N17:BZ17)<0.5, \"To start\", \"Running\")))","v":"Undefined"},0,0,{"$f":"IF(ISBLANK($I17), \"Undefined\", IF(CC17<0.5, \"Complete\",IF(SUMPRODUCT($N$41:CC$41,$N17:CC17)<0.5, \"To start\", \"Running\")))","v":"Undefined"},0,0,{"$f":"IF(ISBLANK($I17), \"Undefined\", IF(CF17<0.5, \"Complete\",IF(SUMPRODUCT($N$41:CF$41,$N17:CF17)<0.5, \"To start\", \"Running\")))","v":"Undefined"},0,0,{"$f":"IF(ISBLANK($I17), \"Undefined\", IF(CI17<0.5, \"Complete\",IF(SUMPRODUCT($N$41:CI$41,$N17:CI17)<0.5, \"To start\", \"Running\")))","v":"Undefined"},0,0,{"$f":"IF(ISBLANK($I17), \"Undefined\", IF(CL17<0.5, \"Complete\",IF(SUMPRODUCT($N$41:CL$41,$N17:CL17)<0.5, \"To start\", \"Running\")))","v":"Undefined"},0,0,{"$f":"IF(ISBLANK($I17), \"Undefined\", IF(CO17<0.5, \"Complete\",IF(SUMPRODUCT($N$41:CO$41,$N17:CO17)<0.5, \"To start\", \"Running\")))","v":"Undefined"},0,0,{"$f":"IF(ISBLANK($I17), \"Undefined\", IF(CR17<0.5, \"Complete\",IF(SUMPRODUCT($N$41:CR$41,$N17:CR17)<0.5, \"To start\", \"Running\")))","v":"Undefined"},0,0,{"$f":"IF(ISBLANK($I17), \"Undefined\", IF(CU17<0.5, \"Complete\",IF(SUMPRODUCT($N$41:CU$41,$N17:CU17)<0.5, \"To start\", \"Running\")))","v":"Undefined"},0,0,{"$f":"IF(ISBLANK($I17), \"Undefined\", IF(CX17<0.5, \"Complete\",IF(SUMPRODUCT($N$41:CX$41,$N17:CX17)<0.5, \"To start\", \"Running\")))","v":"Undefined"},0,0,{"$f":"IF(ISBLANK($I17), \"Undefined\", IF(DA17<0.5, \"Complete\",IF(SUMPRODUCT($N$41:DA$41,$N17:DA17)<0.5, \"To start\", \"Running\")))","v":"Undefined"},0,0,{"$f":"IF(ISBLANK($I17), \"Undefined\", IF(DD17<0.5, \"Complete\",IF(SUMPRODUCT($N$41:DD$41,$N17:DD17)<0.5, \"To start\", \"Running\")))","v":"Undefined"},0,0,{"$f":"IF(ISBLANK($I17), \"Undefined\", IF(DG17<0.5, \"Complete\",IF(SUMPRODUCT($N$41:DG$41,$N17:DG17)<0.5, \"To start\", \"Running\")))","v":"Undefined"},0,0,{"$f":"IF(ISBLANK($I17), \"Undefined\", IF(DJ17<0.5, \"Complete\",IF(SUMPRODUCT($N$41:DJ$41,$N17:DJ17)<0.5, \"To start\", \"Running\")))","v":"Undefined"},0,0,{"$f":"IF(ISBLANK($I17), \"Undefined\", IF(DM17<0.5, \"Complete\",IF(SUMPRODUCT($N$41:DM$41,$N17:DM17)<0.5, \"To start\", \"Running\")))","v":"Undefined"},0,0,{"$f":"IF(ISBLANK($I17), \"Undefined\", IF(DP17<0.5, \"Complete\",IF(SUMPRODUCT($N$41:DP$41,$N17:DP17)<0.5, \"To start\", \"Running\")))","v":"Undefined"},0,0,{"$f":"IF(ISBLANK($I17), \"Undefined\", IF(DS17<0.5, \"Complete\",IF(SUMPRODUCT($N$41:DS$41,$N17:DS17)<0.5, \"To start\", \"Running\")))","v":"Undefined"},0,0,{"$f":"IF(ISBLANK($I17), \"Undefined\", IF(DV17<0.5, \"Complete\",IF(SUMPRODUCT($N$41:DV$41,$N17:DV17)<0.5, \"To start\", \"Running\")))","v":"Undefined"},0,0,{"$f":"IF(ISBLANK($I17), \"Undefined\", IF(DY17<0.5, \"Complete\",IF(SUMPRODUCT($N$41:DY$41,$N17:DY17)<0.5, \"To start\", \"Running\")))","v":"Undefined"},0,0,{"$f":"IF(ISBLANK($I17), \"Undefined\", IF(EB17<0.5, \"Complete\",IF(SUMPRODUCT($N$41:EB$41,$N17:EB17)<0.5, \"To start\", \"Running\")))","v":"Undefined"},null,{"$f":"SUMPRODUCT($L$41:DK$41,$L17:DK17)","v":0},0,{"$f":"OFFSET($O17,0,(Capacity!$F$2-SprintStart)*3,1,1)","v":0},0,0,0,"",0,0]
[{"$nulls":10},{"$f":"IF(SprintStart>Capacity!$F$2, \"To start\", INDEX(Burndown,ROW(K18)-ROW(K$6),MIN(Capacity!$F$2-SprintStart,29)*3+3))","v":"Undefined"},null,0,0,0,{"$f":"IF(ISBLANK($I18), \"Undefined\", IF(O18<0.5, \"Complete\",IF(SUMPRODUCT($N$41:O$41,$N18:O18)<0.5, \"To start\", \"Running\")))","v":"Undefined"},0,0,{"$f":"IF(ISBLANK($I18), \"Undefined\", IF(R18<0.5, \"Complete\",IF(SUMPRODUCT($N$41:R$41,$N18:R18)<0.5, \"To start\", \"Running\")))","v":"Undefined"},0,0,{"$f":"IF(ISBLANK($I18), \"Undefined\", IF(U18<0.5, \"Complete\",IF(SUMPRODUCT($N$41:U$41,$N18:U18)<0.5, \"To start\", \"Running\")))","v":"Undefined"},0,0,{"$f":"IF(ISBLANK($I18), \"Undefined\", IF(X18<0.5, \"Complete\",IF(SUMPRODUCT($N$41:X$41,$N18:X18)<0.5, \"To start\", \"Running\")))","v":"Undefined"},0,0,{"$f":"IF(ISBLANK($I18), \"Undefined\", IF(AA18<0.5, \"Complete\",IF(SUMPRODUCT($N$41:AA$41,$N18:AA18)<0.5, \"To start\", \"Running\")))","v":"Undefined"},0,0,{"$f":"IF(ISBLANK($I18), \"Undefined\", IF(AD18<0.5, \"Complete\",IF(SUMPRODUCT($N$41:AD$41,$N18:AD18)<0.5, \"To start\", \"Running\")))","v":"Undefined"},0,0,{"$f":"IF(ISBLANK($I18), \"Undefined\", IF(AG18<0.5, \"Complete\",IF(SUMPRODUCT($N$41:AG$41,$N18:AG18)<0.5, \"To start\", \"Running\")))","v":"Undefined"},0,0,{"$f":"IF(ISBLANK($I18), \"Undefined\", IF(AJ18<0.5, \"Complete\",IF(SUMPRODUCT($N$41:AJ$41,$N18:AJ18)<0.5, \"To start\", \"Running\")))","v":"Undefined"},0,0,{"$f":"IF(ISBLANK($I18), \"Undefined\", IF(AM18<0.5, \"Complete\",IF(SUMPRODUCT($N$41:AM$41,$N18:AM18)<0.5, \"To start\", \"Running\")))","v":"Undefined"},0,0,{"$f":"IF(ISBLANK($I18), \"Undefined\", IF(AP18<0.5, \"Complete\",IF(SUMPRODUCT($N$41:AP$41,$N18:AP18)<0.5, \"To start\", \"Running\")))","v":"Undefined"},0,0,{"$f":"IF(ISBLANK($I18), \"Undefined\", IF(AS18<0.5, \"Complete\",IF(SUMPRODUCT($N$41:AS$41,$N18:AS18)<0.5, \"To start\", \"Running\")))","v":"Undefined"},0,0,{"$f":"IF(ISBLANK($I18), \"Undefined\", IF(AV18<0.5, \"Complete\",IF(SUMPRODUCT($N$41:AV$41,$N18:AV18)<0.5, \"To start\", \"Running\")))","v":"Undefined"},0,0,{"$f":"IF(ISBLANK($I18), \"Undefined\", IF(AY18<0.5, \"Complete\",IF(SUMPRODUCT($N$41:AY$41,$N18:AY18)<0.5, \"To start\", \"Running\")))","v":"Undefined"},0,0,{"$f":"IF(ISBLANK($I18), \"Undefined\", IF(BB18<0.5, \"Complete\",IF(SUMPRODUCT($N$41:BB$41,$N18:BB18)<0.5, \"To start\", \"Running\")))","v":"Undefined"},0,0,{"$f":"IF(ISBLANK($I18), \"Undefined\", IF(BE18<0.5, \"Complete\",IF(SUMPRODUCT($N$41:BE$41,$N18:BE18)<0.5, \"To start\", \"Running\")))","v":"Undefined"},0,0,{"$f":"IF(ISBLANK($I18), \"Undefined\", IF(BH18<0.5, \"Complete\",IF(SUMPRODUCT($N$41:BH$41,$N18:BH18)<0.5, \"To start\", \"Running\")))","v":"Undefined"},0,0,{"$f":"IF(ISBLANK($I18), \"Undefined\", IF(BK18<0.5, \"Complete\",IF(SUMPRODUCT($N$41:BK$41,$N18:BK18)<0.5, \"To start\", \"Running\")))","v":"Undefined"},0,0,{"$f":"IF(ISBLANK($I18), \"Undefined\", IF(BN18<0.5, \"Complete\",IF(SUMPRODUCT($N$41:BN$41,$N18:BN18)<0.5, \"To start\", \"Running\")))","v":"Undefined"},0,0,{"$f":"IF(ISBLANK($I18), \"Undefined\", IF(BQ18<0.5, \"Complete\",IF(SUMPRODUCT($N$41:BQ$41,$N18:BQ18)<0.5, \"To start\", \"Running\")))","v":"Undefined"},0,0,{"$f":"IF(ISBLANK($I18), \"Undefined\", IF(BT18<0.5, \"Complete\",IF(SUMPRODUCT($N$41:BT$41,$N18:BT18)<0.5, \"To start\", \"Running\")))","v":"Undefined"},0,0,{"$f":"IF(ISBLANK($I18), \"Undefined\", IF(BW18<0.5, \"Complete\",IF(SUMPRODUCT($N$41:BW$41,$N18:BW18)<0.5, \"To start\", \"Running\")))","v":"Undefined"},0,0,{"$f":"IF(ISBLANK($I18), \"Undefined\", IF(BZ18<0.5, \"Complete\",IF(SUMPRODUCT($N$41:BZ$41,$N18:BZ18)<0.5, \"To start\", \"Running\")))","v":"Undefined"},0,0,{"$f":"IF(ISBLANK($I18), \"Undefined\", IF(CC18<0.5, \"Complete\",IF(SUMPRODUCT($N$41:CC$41,$N18:CC18)<0.5, \"To start\", \"Running\")))","v":"Undefined"},0,0,{"$f":"IF(ISBLANK($I18), \"Undefined\", IF(CF18<0.5, \"Complete\",IF(SUMPRODUCT($N$41:CF$41,$N18:CF18)<0.5, \"To start\", \"Running\")))","v":"Undefined"},0,0,{"$f":"IF(ISBLANK($I18), \"Undefined\", IF(CI18<0.5, \"Complete\",IF(SUMPRODUCT($N$41:CI$41,$N18:CI18)<0.5, \"To start\", \"Running\")))","v":"Undefined"},0,0,{"$f":"IF(ISBLANK($I18), \"Undefined\", IF(CL18<0.5, \"Complete\",IF(SUMPRODUCT($N$41:CL$41,$N18:CL18)<0.5, \"To start\", \"Running\")))","v":"Undefined"},0,0,{"$f":"IF(ISBLANK($I18), \"Undefined\", IF(CO18<0.5, \"Complete\",IF(SUMPRODUCT($N$41:CO$41,$N18:CO18)<0.5, \"To start\", \"Running\")))","v":"Undefined"},0,0,{"$f":"IF(ISBLANK($I18), \"Undefined\", IF(CR18<0.5, \"Complete\",IF(SUMPRODUCT($N$41:CR$41,$N18:CR18)<0.5, \"To start\", \"Running\")))","v":"Undefined"},0,0,{"$f":"IF(ISBLANK($I18), \"Undefined\", IF(CU18<0.5, \"Complete\",IF(SUMPRODUCT($N$41:CU$41,$N18:CU18)<0.5, \"To start\", \"Running\")))","v":"Undefined"},0,0,{"$f":"IF(ISBLANK($I18), \"Undefined\", IF(CX18<0.5, \"Complete\",IF(SUMPRODUCT($N$41:CX$41,$N18:CX18)<0.5, \"To start\", \"Running\")))","v":"Undefined"},0,0,{"$f":"IF(ISBLANK($I18), \"Undefined\", IF(DA18<0.5, \"Complete\",IF(SUMPRODUCT($N$41:DA$41,$N18:DA18)<0.5, \"To start\", \"Running\")))","v":"Undefined"},0,0,{"$f":"IF(ISBLANK($I18), \"Undefined\", IF(DD18<0.5, \"Complete\",IF(SUMPRODUCT($N$41:DD$41,$N18:DD18)<0.5, \"To start\", \"Running\")))","v":"Undefined"},0,0,{"$f":"IF(ISBLANK($I18), \"Undefined\", IF(DG18<0.5, \"Complete\",IF(SUMPRODUCT($N$41:DG$41,$N18:DG18)<0.5, \"To start\", \"Running\")))","v":"Undefined"},0,0,{"$f":"IF(ISBLANK($I18), \"Undefined\", IF(DJ18<0.5, \"Complete\",IF(SUMPRODUCT($N$41:DJ$41,$N18:DJ18)<0.5, \"To start\", \"Running\")))","v":"Undefined"},0,0,{"$f":"IF(ISBLANK($I18), \"Undefined\", IF(DM18<0.5, \"Complete\",IF(SUMPRODUCT($N$41:DM$41,$N18:DM18)<0.5, \"To start\", \"Running\")))","v":"Undefined"},0,0,{"$f":"IF(ISBLANK($I18), \"Undefined\", IF(DP18<0.5, \"Complete\",IF(SUMPRODUCT($N$41:DP$41,$N18:DP18)<0.5, \"To start\", \"Running\")))","v":"Undefined"},0,0,{"$f":"IF(ISBLANK($I18), \"Undefined\", IF(DS18<0.5, \"Complete\",IF(SUMPRODUCT($N$41:DS$41,$N18:DS18)<0.5, \"To start\", \"Running\")))","v":"Undefined"},0,0,{"$f":"IF(ISBLANK($I18), \"Undefined\", IF(DV18<0.5, \"Complete\",IF(SUMPRODUCT($N$41:DV$41,$N18:DV18)<0.5, \"To start\", \"Running\")))","v":"Undefined"},0,0,{"$f":"IF(ISBLANK($I18), \"Undefined\", IF(DY18<0.5, \"Complete\",IF(SUMPRODUCT($N$41:DY$41,$N18:DY18)<0.5, \"To start\", \"Running\")))","v":"Undefined"},0,0,{"$f":"IF(ISBLANK($I18), \"Undefined\", IF(EB18<0.5, \"Complete\",IF(SUMPRODUCT($N$41:EB$41,$N18:EB18)<0.5, \"To start\", \"Running\")))","v":"Undefined"},null,{"$f":"SUMPRODUCT($L$41:DK$41,$L18:DK18)","v":0},0,{"$f":"OFFSET($O18,0,(Capacity!$F$2-SprintStart)*3,1,1)","v":0},0,0,0,"",0,0]
[{"$nulls":10},{"$f":"IF(SprintStart>Capacity!$F$2, \"To start\", INDEX(Burndown,ROW(K19)-ROW(K$6),MIN(Capacity!$F$2-SprintStart,29)*3+3))","v":"Undefined"},null,0,0,0,{"$f":"IF(ISBLANK($I19), \"Undefined\", IF(O19<0.5, \"Complete\",IF(SUMPRODUCT($N$41:O$41,$N19:O19)<0.5, \"To start\", \"Running\")))","v":"Undefined"},0,0,{"$f":"IF(ISBLANK($I19), \"Undefined\", IF(R19<0.5, \"Complete\",IF(SUMPRODUCT($N$41:R$41,$N19:R19)<0.5, \"To start\", \"Running\")))","v":"Undefined"},0,0,{"$f":"IF(ISBLANK($I19), \"Undefined\", IF(U19<0.5, \"Complete\",IF(SUMPRODUCT($N$41:U$41,$N19:U19)<0.5, \"To start\", \"Running\")))","v":"Undefined"},0,0,{"$f":"IF(ISBLANK($I19), \"Undefined\", IF(X19<0.5, \"Complete\",IF(SUMPRODUCT($N$41:X$41,$N19:X19)<0.5, \"To start\", \"Running\")))","v":"Undefined"},0,0,{"$f":"IF(ISBLANK($I19), \"Undefined\", IF(AA19<0.5, \"Complete\",IF(SUMPRODUCT($N$41:AA$41,$N19:AA19)<0.5, \"To start\", \"Running\")))","v":"Undefined"},0,0,{"$f":"IF(ISBLANK($I19), \"Undefined\", IF(AD19<0.5, \"Complete\",IF(SUMPRODUCT($N$41:AD$41,$N19:AD19)<0.5, \"To start\", \"Running\")))","v":"Undefined"},0,0,{"$f":"IF(ISBLANK($I19), \"Undefined\", IF(AG19<0.5, \"Complete\",IF(SUMPRODUCT($N$41:AG$41,$N19:AG19)<0.5, \"To start\", \"Running\")))","v":"Undefined"},0,0,{"$f":"IF(ISBLANK($I19), \"Undefined\", IF(AJ19<0.5, \"Complete\",IF(SUMPRODUCT($N$41:AJ$41,$N19:AJ19)<0.5, \"To start\", \"Running\")))","v":"Undefined"},0,0,{"$f":"IF(ISBLANK($I19), \"Undefined\", IF(AM19<0.5, \"Complete\",IF(SUMPRODUCT($N$41:AM$41,$N19:AM19)<0.5, \"To start\", \"Running\")))","v":"Undefined"},0,0,{"$f":"IF(ISBLANK($I19), \"Undefined\", IF(AP19<0.5, \"Complete\",IF(SUMPRODUCT($N$41:AP$41,$N19:AP19)<0.5, \"To start\", \"Running\")))","v":"Undefined"},0,0,{"$f":"IF(ISBLANK($I19), \"Undefined\", IF(AS19<0.5, \"Complete\",IF(SUMPRODUCT($N$41:AS$41,$N19:AS19)<0.5, \"To start\", \"Running\")))","v":"Undefined"},0,0,{"$f":"IF(ISBLANK($I19), \"Undefined\", IF(AV19<0.5, \"Complete\",IF(SUMPRODUCT($N$41:AV$41,$N19:AV19)<0.5, \"To start\", \"Running\")))","v":"Undefined"},0,0,{"$f":"IF(ISBLANK($I19), \"Undefined\", IF(AY19<0.5, \"Complete\",IF(SUMPRODUCT($N$41:AY$41,$N19:AY19)<0.5, \"To start\", \"Running\")))","v":"Undefined"},0,0,{"$f":"IF(ISBLANK($I19), \"Undefined\", IF(BB19<0.5, \"Complete\",IF(SUMPRODUCT($N$41:BB$41,$N19:BB19)<0.5, \"To start\", \"Running\")))","v":"Undefined"},0,0,{"$f":"IF(ISBLANK($I19), \"Undefined\", IF(BE19<0.5, \"Complete\",IF(SUMPRODUCT($N$41:BE$41,$N19:BE19)<0.5, \"To start\", \"Running\")))","v":"Undefined"},0,0,{"$f":"IF(ISBLANK($I19), \"Undefined\", IF(BH19<0.5, \"Complete\",IF(SUMPRODUCT($N$41:BH$41,$N19:BH19)<0.5, \"To start\", \"Running\")))","v":"Undefined"},0,0,{"$f":"IF(ISBLANK($I19), \"Undefined\", IF(BK19<0.5, \"Complete\",IF(SUMPRODUCT($N$41:BK$41,$N19:BK19)<0.5, \"To start\", \"Running\")))","v":"Undefined"},0,0,{"$f":"IF(ISBLANK($I19), \"Undefined\", IF(BN19<0.5, \"Complete\",IF(SUMPRODUCT($N$41:BN$41,$N19:BN19)<0.5, \"To start\", \"Running\")))","v":"Undefined"},0,0,{"$f":"IF(ISBLANK($I19), \"Undefined\", IF(BQ19<0.5, \"Complete\",IF(SUMPRODUCT($N$41:BQ$41,$N19:BQ19)<0.5, \"To start\", \"Running\")))","v":"Undefined"},0,0,{"$f":"IF(ISBLANK($I19), \"Undefined\", IF(BT19<0.5, \"Complete\",IF(SUMPRODUCT($N$41:BT$41,$N19:BT19)<0.5, \"To start\", \"Running\")))","v":"Undefined"},0,0,{"$f":"IF(ISBLANK($I19), \"Undefined\", IF(BW19<0.5, \"Complete\",IF(SUMPRODUCT($N$41:BW$41,$N19:BW19)<0.5, \"To start\", \"Running\")))","v":"Undefined"},0,0,{"$f":"IF(ISBLANK($I19), \"Undefined\", IF(BZ19<0.5, \"Complete\",IF(SUMPRODUCT($N$41:BZ$41,$N19:BZ19)<0.5, \"To start\", \"Running\")))","v":"Undefined"},0,0,{"$f":"IF(ISBLANK($I19), \"Undefined\", IF(CC19<0.5, \"Complete\",IF(SUMPRODUCT($N$41:CC$41,$N19:CC19)<0.5, \"To start\", \"Running\")))","v":"Undefined"},0,0,{"$f":"IF(ISBLANK($I19), \"Undefined\", IF(CF19<0.5, \"Complete\",IF(SUMPRODUCT($N$41:CF$41,$N19:CF19)<0.5, \"To start\", \"Running\")))","v":"Undefined"},0,0,{"$f":"IF(ISBLANK($I19), \"Undefined\", IF(CI19<0.5, \"Complete\",IF(SUMPRODUCT($N$41:CI$41,$N19:CI19)<0.5, \"To start\", \"Running\")))","v":"Undefined"},0,0,{"$f":"IF(ISBLANK($I19), \"Undefined\", IF(CL19<0.5, \"Complete\",IF(SUMPRODUCT($N$41:CL$41,$N19:CL19)<0.5, \"To start\", \"Running\")))","v":"Undefined"},0,0,{"$f":"IF(ISBLANK($I19), \"Undefined\", IF(CO19<0.5, \"Complete\",IF(SUMPRODUCT($N$41:CO$41,$N19:CO19)<0.5, \"To start\", \"Running\")))","v":"Undefined"},0,0,{"$f":"IF(ISBLANK($I19), \"Undefined\", IF(CR19<0.5, \"Complete\",IF(SUMPRODUCT($N$41:CR$41,$N19:CR19)<0.5, \"To start\", \"Running\")))","v":"Undefined"},0,0,{"$f":"IF(ISBLANK($I19), \"Undefined\", IF(CU19<0.5, \"Complete\",IF(SUMPRODUCT($N$41:CU$41,$N19:CU19)<0.5, \"To start\", \"Running\")))","v":"Undefined"},0,0,{"$f":"IF(ISBLANK($I19), \"Undefined\", IF(CX19<0.5, \"Complete\",IF(SUMPRODUCT($N$41:CX$41,$N19:CX19)<0.5, \"To start\", \"Running\")))","v":"Undefined"},0,0,{"$f":"IF(ISBLANK($I19), \"Undefined\", IF(DA19<0.5, \"Complete\",IF(SUMPRODUCT($N$41:DA$41,$N19:DA19)<0.5, \"To start\", \"Running\")))","v":"Undefined"},0,0,{"$f":"IF(ISBLANK($I19), \"Undefined\", IF(DD19<0.5, \"Complete\",IF(SUMPRODUCT($N$41:DD$41,$N19:DD19)<0.5, \"To start\", \"Running\")))","v":"Undefined"},0,0,{"$f":"IF(ISBLANK($I19), \"Undefined\", IF(DG19<0.5, \"Complete\",IF(SUMPRODUCT($N$41:DG$41,$N19:DG19)<0.5, \"To start\", \"Running\")))","v":"Undefined"},0,0,{"$f":"IF(ISBLANK($I19), \"Undefined\", IF(DJ19<0.5, \"Complete\",IF(SUMPRODUCT($N$41:DJ$41,$N19:DJ19)<0.5, \"To start\", \"Running\")))","v":"Undefined"},0,0,{"$f":"IF(ISBLANK($I19), \"Undefined\", IF(DM19<0.5, \"Complete\",IF(SUMPRODUCT($N$41:DM$41,$N19:DM19)<0.5, \"To start\", \"Running\")))","v":"Undefined"},0,0,{"$f":"IF(ISBLANK($I19), \"Undefined\", IF(DP19<0.5, \"Complete\",IF(SUMPRODUCT($N$41:DP$41,$N19:DP19)<0.5, \"To start\", \"Running\")))","v":"Undefined"},0,0,{"$f":"IF(ISBLANK($I19), \"Undefined\", IF(DS19<0.5, \"Complete\",IF(SUMPRODUCT($N$41:DS$41,$N19:DS19)<0.5, \"To start\", \"Running\")))","v":"Undefined"},0,0,{"$f":"IF(ISBLANK($I19), \"Undefined\", IF(DV19<0.5, \"Complete\",IF(SUMPRODUCT($N$41:DV$41,$N19:DV19)<0.5, \"To start\", \"Running\")))","v":"Undefined"},0,0,{"$f":"IF(ISBLANK($I19), \"Undefined\", IF(DY19<0.5, \"Complete\",IF(SUMPRODUCT($N$41:DY$41,$N19:DY19)<0.5, \"To start\", \"Running\")))","v":"Undefined"},0,0,{"$f":"IF(ISBLANK($I19), \"Undefined\", IF(EB19<0.5, \"Complete\",IF(SUMPRODUCT($N$41:EB$41,$N19:EB19)<0.5, \"To start\", \"Running\")))","v":"Undefined"},null,{"$f":"SUMPRODUCT($L$41:DK$41,$L19:DK19)","v":0},0,{"$f":"OFFSET($O19,0,(Capacity!$F$2-SprintStart)*3,1,1)","v":0},0,0,0,"",0,0]
[{"$nulls":10},{"$f":"IF(SprintStart>Capacity!$F$2, \"To start\", INDEX(Burndown,ROW(K20)-ROW(K$6),MIN(Capacity!$F$2-SprintStart,29)*3+3))","v":"Undefined"},null,0,0,0,{"$f":"IF(ISBLANK($I20), \"Undefined\", IF(O20<0.5, \"Complete\",IF(SUMPRODUCT($N$41:O$41,$N20:O20)<0.5, \"To start\", \"Running\")))","v":"Undefined"},0,0,{"$f":"IF(ISBLANK($I20), \"Undefined\", IF(R20<0.5, \"Complete\",IF(SUMPRODUCT($N$41:R$41,$N20:R20)<0.5, \"To start\", \"Running\")))","v":"Undefined"},0,0,{"$f":"IF(ISBLANK($I20), \"Undefined\", IF(U20<0.5, \"Complete\",IF(SUMPRODUCT($N$41:U$41,$N20:U20)<0.5, \"To start\", \"Running\")))","v":"Undefined"},0,0,{"$f":"IF(ISBLANK($I20), \"Undefined\", IF(X20<0.5, \"Complete\",IF(SUMPRODUCT($N$41:X$41,$N20:X20)<0.5, \"To start\", \"Running\")))","v":"Undefined"},0,0,{"$f":"IF(ISBLANK($I20), \"Undefined\", IF(AA20<0.5, \"Complete\",IF(SUMPRODUCT($N$41:AA$41,$N20:AA20)<0.5, \"To start\", \"Running\")))","v":"Undefined"},0,0,{"$f":"IF(ISBLANK($I20), \"Undefined\", IF(AD20<0.5, \"Complete\",IF(SUMPRODUCT($N$41:AD$41,$N20:AD20)<0.5, \"To start\", \"Running\")))","v":"Undefined"},0,0,{"$f":"IF(ISBLANK($I20), \"Undefined\", IF(AG20<0.5, \"Complete\",IF(SUMPRODUCT($N$41:AG$41,$N20:AG20)<0.5, \"To start\", \"Running\")))","v":"Undefined"},0,0,{"$f":"IF(ISBLANK($I20), \"Undefined\", IF(AJ20<0.5, \"Complete\",IF(SUMPRODUCT($N$41:AJ$41,$N20:AJ20)<0.5, \"To start\", \"Running\")))","v":"Undefined"},0,0,{"$f":"IF(ISBLANK($I20), \"Undefined\", IF(AM20<0.5, \"Complete\",IF(SUMPRODUCT($N$41:AM$41,$N20:AM20)<0.5, \"To start\", \"Running\")))","v":"Undefined"},0,0,{"$f":"IF(ISBLANK($I20), \"Undefined\", IF(AP20<0.5, \"Complete\",IF(SUMPRODUCT($N$41:AP$41,$N20:AP20)<0.5, \"To start\", \"Running\")))","v":"Undefined"},0,0,{"$f":"IF(ISBLANK($I20), \"Undefined\", IF(AS20<0.5, \"Complete\",IF(SUMPRODUCT($N$41:AS$41,$N20:AS20)<0.5, \"To start\", \"Running\")))","v":"Undefined"},0,0,{"$f":"IF(ISBLANK($I20), \"Undefined\", IF(AV20<0.5, \"Complete\",IF(SUMPRODUCT($N$41:AV$41,$N20:AV20)<0.5, \"To start\", \"Running\")))","v":"Undefined"},0,0,{"$f":"IF(ISBLANK($I20), \"Undefined\", IF(AY20<0.5, \"Complete\",IF(SUMPRODUCT($N$41:AY$41,$N20:AY20)<0.5, \"To start\", \"Running\")))","v":"Undefined"},0,0,{"$f":"IF(ISBLANK($I20), \"Undefined\", IF(BB20<0.5, \"Complete\",IF(SUMPRODUCT($N$41:BB$41,$N20:BB20)<0.5, \"To start\", \"Running\")))","v":"Undefined"},0,0,{"$f":"IF(ISBLANK($I20), \"Undefined\", IF(BE20<0.5, \"Complete\",IF(SUMPRODUCT($N$41:BE$41,$N20:BE20)<0.5, \"To start\", \"Running\")))","v":"Undefined"},0,0,{"$f":"IF(ISBLANK($I20), \"Undefined\", IF(BH20<0.5, \"Complete\",IF(SUMPRODUCT($N$41:BH$41,$N20:BH20)<0.5, \"To start\", \"Running\")))","v":"Undefined"},0,0,{"$f":"IF(ISBLANK($I20), \"Undefined\", IF(BK20<0.5, \"Complete\",IF(SUMPRODUCT($N$41:BK$41,$N20:BK20)<0.5, \"To start\", \"Running\")))","v":"Undefined"},0,0,{"$f":"IF(ISBLANK($I20), \"Undefined\", IF(BN20<0.5, \"Complete\",IF(SUMPRODUCT($N$41:BN$41,$N20:BN20)<0.5, \"To start\", \"Running\")))","v":"Undefined"},0,0,{"$f":"IF(ISBLANK($I20), \"Undefined\", IF(BQ20<0.5, \"Complete\",IF(SUMPRODUCT($N$41:BQ$41,$N20:BQ20)<0.5, \"To start\", \"Running\")))","v":"Undefined"},0,0,{"$f":"IF(ISBLANK($I20), \"Undefined\", IF(BT20<0.5, \"Complete\",IF(SUMPRODUCT($N$41:BT$41,$N20:BT20)<0.5, \"To start\", \"Running\")))","v":"Undefined"},0,0,{"$f":"IF(ISBLANK($I20), \"Undefined\", IF(BW20<0.5, \"Complete\",IF(SUMPRODUCT($N$41:BW$41,$N20:BW20)<0.5, \"To start\", \"Running\")))","v":"Undefined"},0,0,{"$f":"IF(ISBLANK($I20), \"Undefined\", IF(BZ20<0.5, \"Complete\",IF(SUMPRODUCT($N$41:BZ$41,$N20:BZ20)<0.5, \"To start\", \"Running\")))","v":"Undefined"},0,0,{"$f":"IF(ISBLANK($I20), \"Undefined\", IF(CC20<0.5, \"Complete\",IF(SUMPRODUCT($N$41:CC$41,$N20:CC20)<0.5, \"To start\", \"Running\")))","v":"Undefined"},0,0,{"$f":"IF(ISBLANK($I20), \"Undefined\", IF(CF20<0.5, \"Complete\",IF(SUMPRODUCT($N$41:CF$41,$N20:CF20)<0.5, \"To start\", \"Running\")))","v":"Undefined"},0,0,{"$f":"IF(ISBLANK($I20), \"Undefined\", IF(CI20<0.5, \"Complete\",IF(SUMPRODUCT($N$41:CI$41,$N20:CI20)<0.5, \"To start\", \"Running\")))","v":"Undefined"},0,0,{"$f":"IF(ISBLANK($I20), \"Undefined\", IF(CL20<0.5, \"Complete\",IF(SUMPRODUCT($N$41:CL$41,$N20:CL20)<0.5, \"To start\", \"Running\")))","v":"Undefined"},0,0,{"$f":"IF(ISBLANK($I20), \"Undefined\", IF(CO20<0.5, \"Complete\",IF(SUMPRODUCT($N$41:CO$41,$N20:CO20)<0.5, \"To start\", \"Running\")))","v":"Undefined"},0,0,{"$f":"IF(ISBLANK($I20), \"Undefined\", IF(CR20<0.5, \"Complete\",IF(SUMPRODUCT($N$41:CR$41,$N20:CR20)<0.5, \"To start\", \"Running\")))","v":"Undefined"},0,0,{"$f":"IF(ISBLANK($I20), \"Undefined\", IF(CU20<0.5, \"Complete\",IF(SUMPRODUCT($N$41:CU$41,$N20:CU20)<0.5, \"To start\", \"Running\")))","v":"Undefined"},0,0,{"$f":"IF(ISBLANK($I20), \"Undefined\", IF(CX20<0.5, \"Complete\",IF(SUMPRODUCT($N$41:CX$41,$N20:CX20)<0.5, \"To start\", \"Running\")))","v":"Undefined"},0,0,{"$f":"IF(ISBLANK($I20), \"Undefined\", IF(DA20<0.5, \"Complete\",IF(SUMPRODUCT($N$41:DA$41,$N20:DA20)<0.5, \"To start\", \"Running\")))","v":"Undefined"},0,0,{"$f":"IF(ISBLANK($I20), \"Undefined\", IF(DD20<0.5, \"Complete\",IF(SUMPRODUCT($N$41:DD$41,$N20:DD20)<0.5, \"To start\", \"Running\")))","v":"Undefined"},0,0,{"$f":"IF(ISBLANK($I20), \"Undefined\", IF(DG20<0.5, \"Complete\",IF(SUMPRODUCT($N$41:DG$41,$N20:DG20)<0.5, \"To start\", \"Running\")))","v":"Undefined"},0,0,{"$f":"IF(ISBLANK($I20), \"Undefined\", IF(DJ20<0.5, \"Complete\",IF(SUMPRODUCT($N$41:DJ$41,$N20:DJ20)<0.5, \"To start\", \"Running\")))","v":"Undefined"},0,0,{"$f":"IF(ISBLANK($I20), \"Undefined\", IF(DM20<0.5, \"Complete\",IF(SUMPRODUCT($N$41:DM$41,$N20:DM20)<0.5, \"To start\", \"Running\")))","v":"Undefined"},0,0,{"$f":"IF(ISBLANK($I20), \"Undefined\", IF(DP20<0.5, \"Complete\",IF(SUMPRODUCT($N$41:DP$41,$N20:DP20)<0.5, \"To start\", \"Running\")))","v":"Undefined"},0,0,{"$f":"IF(ISBLANK($I20), \"Undefined\", IF(DS20<0.5, \"Complete\",IF(SUMPRODUCT($N$41:DS$41,$N20:DS20)<0.5, \"To start\", \"Running\")))","v":"Undefined"},0,0,{"$f":"IF(ISBLANK($I20), \"Undefined\", IF(DV20<0.5, \"Complete\",IF(SUMPRODUCT($N$41:DV$41,$N20:DV20)<0.5, \"To start\", \"Running\")))","v":"Undefined"},0,0,{"$f":"IF(ISBLANK($I20), \"Undefined\", IF(DY20<0.5, \"Complete\",IF(SUMPRODUCT($N$41:DY$41,$N20:DY20)<0.5, \"To start\", \"Running\")))","v":"Undefined"},0,0,{"$f":"IF(ISBLANK($I20), \"Undefined\", IF(EB20<0.5, \"Complete\",IF(SUMPRODUCT($N$41:EB$41,$N20:EB20)<0.5, \"To start\", \"Running\")))","v":"Undefined"},null,{"$f":"SUMPRODUCT($L$41:DK$41,$L20:DK20)","v":0},0,{"$f":"OFFSET($O20,0,(Capacity!$F$2-SprintStart)*3,1,1)","v":0},0,0,0,"",0,0]
[{"$nulls":10},{"$f":"IF(SprintStart>Capacity!$F$2, \"To start\", INDEX(Burndown,ROW(K21)-ROW(K$6),MIN(Capacity!$F$2-SprintStart,29)*3+3))","v":"Undefined"},null,0,0,0,{"$f":"IF(ISBLANK($I21), \"Undefined\", IF(O21<0.5, \"Complete\",IF(SUMPRODUCT($N$41:O$41,$N21:O21)<0.5, \"To start\", \"Running\")))","v":"Undefined"},0,0,{"$f":"IF(ISBLANK($I21), \"Undefined\", IF(R21<0.5, \"Complete\",IF(SUMPRODUCT($N$41:R$41,$N21:R21)<0.5, \"To start\", \"Running\")))","v":"Undefined"},0,0,{"$f":"IF(ISBLANK($I21), \"Undefined\", IF(U21<0.5, \"Complete\",IF(SUMPRODUCT($N$41:U$41,$N21:U21)<0.5, \"To start\", \"Running\")))","v":"Undefined"},0,0,{"$f":"IF(ISBLANK($I21), \"Undefined\", IF(X21<0.5, \"Complete\",IF(SUMPRODUCT($N$41:X$41,$N21:X21)<0.5, \"To start\", \"Running\")))","v":"Undefined"},0,0,{"$f":"IF(ISBLANK($I21), \"Undefined\", IF(AA21<0.5, \"Complete\",IF(SUMPRODUCT($N$41:AA$41,$N21:AA21)<0.5, \"To start\", \"Running\")))","v":"Undefined"},0,0,{"$f":"IF(ISBLANK($I21), \"Undefined\", IF(AD21<0.5, \"Complete\",IF(SUMPRODUCT($N$41:AD$41,$N21:AD21)<0.5, \"To start\", \"Running\")))","v":"Undefined"},0,0,{"$f":"IF(ISBLANK($I21), \"Undefined\", IF(AG21<0.5, \"Complete\",IF(SUMPRODUCT($N$41:AG$41,$N21:AG21)<0.5, \"To start\", \"Running\")))","v":"Undefined"},0,{"$f":"MAX(AG21-AI21,0)","v":0},{"$f":"IF(ISBLANK($I21), \"Undefined\", IF(AJ21<0.5, \"Complete\",IF(SUMPRODUCT($N$41:AJ$41,$N21:AJ21)<0.5, \"To start\", \"Running\")))","v":"Undefined"},0,0,{"$f":"IF(ISBLANK($I21), \"Undefined\", IF(AM21<0.5, \"Complete\",IF(SUMPRODUCT($N$41:AM$41,$N21:AM21)<0.5, \"To start\", \"Running\")))","v":"Undefined"},0,0,{"$f":"IF(ISBLANK($I21), \"Undefined\", IF(AP21<0.5, \"Complete\",IF(SUMPRODUCT($N$41:AP$41,$N21:AP21)<0.5, \"To start\", \"Running\")))","v":"Undefined"},0,0,{"$f":"IF(ISBLANK($I21), \"Undefined\", IF(AS21<0.5, \"Complete\",IF(SUMPRODUCT($N$41:AS$41,$N21:AS21)<0.5, \"To start\", \"Running\")))","v":"Undefined"},0,0,{"$f":"IF(ISBLANK($I21), \"Undefined\", IF(AV21<0.5, \"Complete\",IF(SUMPRODUCT($N$41:AV$41,$N21:AV21)<0.5, \"To start\", \"Running\")))","v":"Undefined"},0,0,{"$f":"IF(ISBLANK($I21), \"Undefined\", IF(AY21<0.5, \"Complete\",IF(SUMPRODUCT($N$41:AY$41,$N21:AY21)<0.5, \"To start\", \"Running\")))","v":"Undefined"},0,0,{"$f":"IF(ISBLANK($I21), \"Undefined\", IF(BB21<0.5, \"Complete\",IF(SUMPRODUCT($N$41:BB$41,$N21:BB21)<0.5, \"To start\", \"Running\")))","v":"Undefined"},0,0,{"$f":"IF(ISBLANK($I21), \"Undefined\", IF(BE21<0.5, \"Complete\",IF(SUMPRODUCT($N$41:BE$41,$N21:BE21)<0.5, \"To start\", \"Running\")))","v":"Undefined"},0,0,{"$f":"IF(ISBLANK($I21), \"Undefined\", IF(BH21<0.5, \"Complete\",IF(SUMPRODUCT($N$41:BH$41,$N21:BH21)<0.5, \"To start\", \"Running\")))","v":"Undefined"},0,0,{"$f":"IF(ISBLANK($I21), \"Undefined\", IF(BK21<0.5, \"Complete\",IF(SUMPRODUCT($N$41:BK$41,$N21:BK21)<0.5, \"To start\", \"Running\")))","v":"Undefined"},0,0,{"$f":"IF(ISBLANK($I21), \"Undefined\", IF(BN21<0.5, \"Complete\",IF(SUMPRODUCT($N$41:BN$41,$N21:BN21)<0.5, \"To start\", \"Running\")))","v":"Undefined"},0,0,{"$f":"IF(ISBLANK($I21), \"Undefined\", IF(BQ21<0.5, \"Complete\",IF(SUMPRODUCT($N$41:BQ$41,$N21:BQ21)<0.5, \"To start\", \"Running\")))","v":"Undefined"},0,0,{"$f":"IF(ISBLANK($I21), \"Undefined\", IF(BT21<0.5, \"Complete\",IF(SUMPRODUCT($N$41:BT$41,$N21:BT21)<0.5, \"To start\", \"Running\")))","v":"Undefined"},0,0,{"$f":"IF(ISBLANK($I21), \"Undefined\", IF(BW21<0.5, \"Complete\",IF(SUMPRODUCT($N$41:BW$41,$N21:BW21)<0.5, \"To start\", \"Running\")))","v":"Undefined"},0,0,{"$f":"IF(ISBLANK($I21), \"Undefined\", IF(BZ21<0.5, \"Complete\",IF(SUMPRODUCT($N$41:BZ$41,$N21:BZ21)<0.5, \"To start\", \"Running\")))","v":"Undefined"},0,0,{"$f":"IF(ISBLANK($I21), \"Undefined\", IF(CC21<0.5, \"Complete\",IF(SUMPRODUCT($N$41:CC$41,$N21:CC21)<0.5, \"To start\", \"Running\")))","v":"Undefined"},0,0,{"$f":"IF(ISBLANK($I21), \"Undefined\", IF(CF21<0.5, \"Complete\",IF(SUMPRODUCT($N$41:CF$41,$N21:CF21)<0.5, \"To start\", \"Running\")))","v":"Undefined"},0,0,{"$f":"IF(ISBLANK($I21), \"Undefined\", IF(CI21<0.5, \"Complete\",IF(SUMPRODUCT($N$41:CI$41,$N21:CI21)<0.5, \"To start\", \"Running\")))","v":"Undefined"},0,0,{"$f":"IF(ISBLANK($I21), \"Undefined\", IF(CL21<0.5, \"Complete\",IF(SUMPRODUCT($N$41:CL$41,$N21:CL21)<0.5, \"To start\", \"Running\")))","v":"Undefined"},0,0,{"$f":"IF(ISBLANK($I21), \"Undefined\", IF(CO21<0.5, \"Complete\",IF(SUMPRODUCT($N$41:CO$41,$N21:CO21)<0.5, \"To start\", \"Running\")))","v":"Undefined"},0,0,{"$f":"IF(ISBLANK($I21), \"Undefined\", IF(CR21<0.5, \"Complete\",IF(SUMPRODUCT($N$41:CR$41,$N21:CR21)<0.5, \"To start\", \"Running\")))","v":"Undefined"},0,0,{"$f":"IF(ISBLANK($I21), \"Undefined\", IF(CU21<0.5, \"Complete\",IF(SUMPRODUCT($N$41:CU$41,$N21:CU21)<0.5, \"To start\", \"Running\")))","v":"Undefined"},0,0,{"$f":"IF(ISBLANK($I21), \"Undefined\", IF(CX21<0.5, \"Complete\",IF(SUMPRODUCT($N$41:CX$41,$N21:CX21)<0.5, \"To start\", \"Running\")))","v":"Undefined"},0,0,{"$f":"IF(ISBLANK($I21), \"Undefined\", IF(DA21<0.5, \"Complete\",IF(SUMPRODUCT($N$41:DA$41,$N21:DA21)<0.5, \"To start\", \"Running\")))","v":"Undefined"},0,0,{"$f":"IF(ISBLANK($I21), \"Undefined\", IF(DD21<0.5, \"Complete\",IF(SUMPRODUCT($N$41:DD$41,$N21:DD21)<0.5, \"To start\", \"Running\")))","v":"Undefined"},0,0,{"$f":"IF(ISBLANK($I21), \"Undefined\", IF(DG21<0.5, \"Complete\",IF(SUMPRODUCT($N$41:DG$41,$N21:DG21)<0.5, \"To start\", \"Running\")))","v":"Undefined"},0,0,{"$f":"IF(ISBLANK($I21), \"Undefined\", IF(DJ21<0.5, \"Complete\",IF(SUMPRODUCT($N$41:DJ$41,$N21:DJ21)<0.5, \"To start\", \"Running\")))","v":"Undefined"},0,0,{"$f":"IF(ISBLANK($I21), \"Undefined\", IF(DM21<0.5, \"Complete\",IF(SUMPRODUCT($N$41:DM$41,$N21:DM21)<0.5, \"To start\", \"Running\")))","v":"Undefined"},0,0,{"$f":"IF(ISBLANK($I21), \"Undefined\", IF(DP21<0.5, \"Complete\",IF(SUMPRODUCT($N$41:DP$41,$N21:DP21)<0.5, \"To start\", \"Running\")))","v":"Undefined"},0,0,{"$f":"IF(ISBLANK($I21), \"Undefined\", IF(DS21<0.5, \"Complete\",IF(SUMPRODUCT($N$41:DS$41,$N21:DS21)<0.5, \"To start\", \"Running\")))","v":"Undefined"},0,0,{"$f":"IF(ISBLANK($I21), \"Undefined\", IF(DV21<0.5, \"Complete\",IF(SUMPRODUCT($N$41:DV$41,$N21:DV21)<0.5, \"To start\", \"Running\")))","v":"Undefined"},0,0,{"$f":"IF(ISBLANK($I21), \"Undefined\", IF(DY21<0.5, \"Complete\",IF(SUMPRODUCT($N$41:DY$41,$N21:DY21)<0.5, \"To start\", \"Running\")))","v":"Undefined"},0,0,{"$f":"IF(ISBLANK($I21), \"Undefined\", IF(EB21<0.5, \"Complete\",IF(SUMPRODUCT($N$41:EB$41,$N21:EB21)<0.5, \"To start\", \"Running\")))","v":"Undefined"},null,{"$f":"SUMPRODUCT($L$41:DK$41,$L21:DK21)","v":0},0,{"$f":"OFFSET($O21,0,(Capacity!$F$2-SprintStart)*3,1,1)","v":0},0,0,0,"",0,0]
[{"$nulls":10},{"$f":"IF(SprintStart>Capacity!$F$2, \"To start\", INDEX(Burndown,ROW(K22)-ROW(K$6),MIN(Capacity!$F$2-SprintStart,29)*3+3))","v":"Undefined"},null,0,0,0,{"$f":"IF(ISBLANK($I22), \"Undefined\", IF(O22<0.5, \"Complete\",IF(SUMPRODUCT($N$41:O$41,$N22:O22)<0.5, \"To start\", \"Running\")))","v":"Undefined"},0,0,{"$f":"IF(ISBLANK($I22), \"Undefined\", IF(R22<0.5, \"Complete\",IF(SUMPRODUCT($N$41:R$41,$N22:R22)<0.5, \"To start\", \"Running\")))","v":"Undefined"},0,0,{"$f":"IF(ISBLANK($I22), \"Undefined\", IF(U22<0.5, \"Complete\",IF(SUMPRODUCT($N$41:U$41,$N22:U22)<0.5, \"To start\", \"Running\")))","v":"Undefined"},0,0,{"$f":"IF(ISBLANK($I22), \"Undefined\", IF(X22<0.5, \"Complete\",IF(SUMPRODUCT($N$41:X$41,$N22:X22)<0.5, \"To start\", \"Running\")))","v":"Undefined"},0,0,{"$f":"IF(ISBLANK($I22), \"Undefined\", IF(AA22<0.5, \"Complete\",IF(SUMPRODUCT($N$41:AA$41,$N22:AA22)<0.5, \"To start\", \"Running\")))","v":"Undefined"},0,0,{"$f":"IF(ISBLANK($I22), \"Undefined\", IF(AD22<0.5, \"Complete\",IF(SUMPRODUCT($N$41:AD$41,$N22:AD22)<0.5, \"To start\", \"Running\")))","v":"Undefined"},0,0,{"$f":"IF(ISBLANK($I22), \"Undefined\", IF(AG22<0.5, \"Complete\",IF(SUMPRODUCT($N$41:AG$41,$N22:AG22)<0.5, \"To start\", \"Running\")))","v":"Undefined"},0,0,{"$f":"IF(ISBLANK($I22), \"Undefined\", IF(AJ22<0.5, \"Complete\",IF(SUMPRODUCT($N$41:AJ$41,$N22:AJ22)<0.5, \"To start\", \"Running\")))","v":"Undefined"},0,0,{"$f":"IF(ISBLANK($I22), \"Undefined\", IF(AM22<0.5, \"Complete\",IF(SUMPRODUCT($N$41:AM$41,$N22:AM22)<0.5, \"To start\", \"Running\")))","v":"Undefined"},0,0,{"$f":"IF(ISBLANK($I22), \"Undefined\", IF(AP22<0.5, \"Complete\",IF(SUMPRODUCT($N$41:AP$41,$N22:AP22)<0.5, \"To start\", \"Running\")))","v":"Undefined"},0,0,{"$f":"IF(ISBLANK($I22), \"Undefined\", IF(AS22<0.5, \"Complete\",IF(SUMPRODUCT($N$41:AS$41,$N22:AS22)<0.5, \"To start\", \"Running\")))","v":"Undefined"},0,0,{"$f":"IF(ISBLANK($I22), \"Undefined\", IF(AV22<0.5, \"Complete\",IF(SUMPRODUCT($N$41:AV$41,$N22:AV22)<0.5, \"To start\", \"Running\")))","v":"Undefined"},0,0,{"$f":"IF(ISBLANK($I22), \"Undefined\", IF(AY22<0.5, \"Complete\",IF(SUMPRODUCT($N$41:AY$41,$N22:AY22)<0.5, \"To start\", \"Running\")))","v":"Undefined"},0,0,{"$f":"IF(ISBLANK($I22), \"Undefined\", IF(BB22<0.5, \"Complete\",IF(SUMPRODUCT($N$41:BB$41,$N22:BB22)<0.5, \"To start\", \"Running\")))","v":"Undefined"},0,0,{"$f":"IF(ISBLANK($I22), \"Undefined\", IF(BE22<0.5, \"Complete\",IF(SUMPRODUCT($N$41:BE$41,$N22:BE22)<0.5, \"To start\", \"Running\")))","v":"Undefined"},0,0,{"$f":"IF(ISBLANK($I22), \"Undefined\", IF(BH22<0.5, \"Complete\",IF(SUMPRODUCT($N$41:BH$41,$N22:BH22)<0.5, \"To start\", \"Running\")))","v":"Undefined"},0,0,{"$f":"IF(ISBLANK($I22), \"Undefined\", IF(BK22<0.5, \"Complete\",IF(SUMPRODUCT($N$41:BK$41,$N22:BK22)<0.5, \"To start\", \"Running\")))","v":"Undefined"},0,0,{"$f":"IF(ISBLANK($I22), \"Undefined\", IF(BN22<0.5, \"Complete\",IF(SUMPRODUCT($N$41:BN$41,$N22:BN22)<0.5, \"To start\", \"Running\")))","v":"Undefined"},0,0,{"$f":"IF(ISBLANK($I22), \"Undefined\", IF(BQ22<0.5, \"Complete\",IF(SUMPRODUCT($N$41:BQ$41,$N22:BQ22)<0.5, \"To start\", \"Running\")))","v":"Undefined"},0,0,{"$f":"IF(ISBLANK($I22), \"Undefined\", IF(BT22<0.5, \"Complete\",IF(SUMPRODUCT($N$41:BT$41,$N22:BT22)<0.5, \"To start\", \"Running\")))","v":"Undefined"},0,0,{"$f":"IF(ISBLANK($I22), \"Undefined\", IF(BW22<0.5, \"Complete\",IF(SUMPRODUCT($N$41:BW$41,$N22:BW22)<0.5, \"To start\", \"Running\")))","v":"Undefined"},0,0,{"$f":"IF(ISBLANK($I22), \"Undefined\", IF(BZ22<0.5, \"Complete\",IF(SUMPRODUCT($N$41:BZ$41,$N22:BZ22)<0.5, \"To start\", \"Running\")))","v":"Undefined"},0,0,{"$f":"IF(ISBLANK($I22), \"Undefined\", IF(CC22<0.5, \"Complete\",IF(SUMPRODUCT($N$41:CC$41,$N22:CC22)<0.5, \"To start\", \"Running\")))","v":"Undefined"},0,0,{"$f":"IF(ISBLANK($I22), \"Undefined\", IF(CF22<0.5, \"Complete\",IF(SUMPRODUCT($N$41:CF$41,$N22:CF22)<0.5, \"To start\", \"Running\")))","v":"Undefined"},0,0,{"$f":"IF(ISBLANK($I22), \"Undefined\", IF(CI22<0.5, \"Complete\",IF(SUMPRODUCT($N$41:CI$41,$N22:CI22)<0.5, \"To start\", \"Running\")))","v":"Undefined"},0,0,{"$f":"IF(ISBLANK($I22), \"Undefined\", IF(CL22<0.5, \"Complete\",IF(SUMPRODUCT($N$41:CL$41,$N22:CL22)<0.5, \"To start\", \"Running\")))","v":"Undefined"},0,0,{"$f":"IF(ISBLANK($I22), \"Undefined\", IF(CO22<0.5, \"Complete\",IF(SUMPRODUCT($N$41:CO$41,$N22:CO22)<0.5, \"To start\", \"Running\")))","v":"Undefined"},0,0,{"$f":"IF(ISBLANK($I22), \"Undefined\", IF(CR22<0.5, \"Complete\",IF(SUMPRODUCT($N$41:CR$41,$N22:CR22)<0.5, \"To start\", \"Running\")))","v":"Undefined"},0,0,{"$f":"IF(ISBLANK($I22), \"Undefined\", IF(CU22<0.5, \"Complete\",IF(SUMPRODUCT($N$41:CU$41,$N22:CU22)<0.5, \"To start\", \"Running\")))","v":"Undefined"},0,0,{"$f":"IF(ISBLANK($I22), \"Undefined\", IF(CX22<0.5, \"Complete\",IF(SUMPRODUCT($N$41:CX$41,$N22:CX22)<0.5, \"To start\", \"Running\")))","v":"Undefined"},0,0,{"$f":"IF(ISBLANK($I22), \"Undefined\", IF(DA22<0.5, \"Complete\",IF(SUMPRODUCT($N$41:DA$41,$N22:DA22)<0.5, \"To start\", \"Running\")))","v":"Undefined"},0,0,{"$f":"IF(ISBLANK($I22), \"Undefined\", IF(DD22<0.5, \"Complete\",IF(SUMPRODUCT($N$41:DD$41,$N22:DD22)<0.5, \"To start\", \"Running\")))","v":"Undefined"},0,0,{"$f":"IF(ISBLANK($I22), \"Undefined\", IF(DG22<0.5, \"Complete\",IF(SUMPRODUCT($N$41:DG$41,$N22:DG22)<0.5, \"To start\", \"Running\")))","v":"Undefined"},0,0,{"$f":"IF(ISBLANK($I22), \"Undefined\", IF(DJ22<0.5, \"Complete\",IF(SUMPRODUCT($N$41:DJ$41,$N22:DJ22)<0.5, \"To start\", \"Running\")))","v":"Undefined"},0,0,{"$f":"IF(ISBLANK($I22), \"Undefined\", IF(DM22<0.5, \"Complete\",IF(SUMPRODUCT($N$41:DM$41,$N22:DM22)<0.5, \"To start\", \"Running\")))","v":"Undefined"},0,0,{"$f":"IF(ISBLANK($I22), \"Undefined\", IF(DP22<0.5, \"Complete\",IF(SUMPRODUCT($N$41:DP$41,$N22:DP22)<0.5, \"To start\", \"Running\")))","v":"Undefined"},0,0,{"$f":"IF(ISBLANK($I22), \"Undefined\", IF(DS22<0.5, \"Complete\",IF(SUMPRODUCT($N$41:DS$41,$N22:DS22)<0.5, \"To start\", \"Running\")))","v":"Undefined"},0,0,{"$f":"IF(ISBLANK($I22), \"Undefined\", IF(DV22<0.5, \"Complete\",IF(SUMPRODUCT($N$41:DV$41,$N22:DV22)<0.5, \"To start\", \"Running\")))","v":"Undefined"},0,0,{"$f":"IF(ISBLANK($I22), \"Undefined\", IF(DY22<0.5, \"Complete\",IF(SUMPRODUCT($N$41:DY$41,$N22:DY22)<0.5, \"To start\", \"Running\")))","v":"Undefined"},0,0,{"$f":"IF(ISBLANK($I22), \"Undefined\", IF(EB22<0.5, \"Complete\",IF(SUMPRODUCT($N$41:EB$41,$N22:EB22)<0.5, \"To start\", \"Running\")))","v":"Undefined"},null,{"$f":"SUMPRODUCT($L$41:DK$41,$L22:DK22)","v":0},0,{"$f":"OFFSET($O22,0,(Capacity!$F$2-SprintStart)*3,1,1)","v":0},0,0,0,"",0,0]
[{"$nulls":10},{"$f":"IF(SprintStart>Capacity!$F$2, \"To start\", INDEX(Burndown,ROW(K23)-ROW(K$6),MIN(Capacity!$F$2-SprintStart,29)*3+3))","v":"Undefined"},null,0,0,0,{"$f":"IF(ISBLANK($I23), \"Undefined\", IF(O23<0.5, \"Complete\",IF(SUMPRODUCT($N$41:O$41,$N23:O23)<0.5, \"To start\", \"Running\")))","v":"Undefined"},0,0,{"$f":"IF(ISBLANK($I23), \"Undefined\", IF(R23<0.5, \"Complete\",IF(SUMPRODUCT($N$41:R$41,$N23:R23)<0.5, \"To start\", \"Running\")))","v":"Undefined"},0,0,{"$f":"IF(ISBLANK($I23), \"Undefined\", IF(U23<0.5, \"Complete\",IF(SUMPRODUCT($N$41:U$41,$N23:U23)<0.5, \"To start\", \"Running\")))","v":"Undefined"},0,0,{"$f":"IF(ISBLANK($I23), \"Undefined\", IF(X23<0.5, \"Complete\",IF(SUMPRODUCT($N$41:X$41,$N23:X23)<0.5, \"To start\", \"Running\")))","v":"Undefined"},0,0,{"$f":"IF(ISBLANK($I23), \"Undefined\", IF(AA23<0.5, \"Complete\",IF(SUMPRODUCT($N$41:AA$41,$N23:AA23)<0.5, \"To start\", \"Running\")))","v":"Undefined"},0,0,{"$f":"IF(ISBLANK($I23), \"Undefined\", IF(AD23<0.5, \"Complete\",IF(SUMPRODUCT($N$41:AD$41,$N23:AD23)<0.5, \"To start\", \"Running\")))","v":"Undefined"},0,0,{"$f":"IF(ISBLANK($I23), \"Undefined\", IF(AG23<0.5, \"Complete\",IF(SUMPRODUCT($N$41:AG$41,$N23:AG23)<0.5, \"To start\", \"Running\")))","v":"Undefined"},0,0,{"$f":"IF(ISBLANK($I23), \"Undefined\", IF(AJ23<0.5, \"Complete\",IF(SUMPRODUCT($N$41:AJ$41,$N23:AJ23)<0.5, \"To start\", \"Running\")))","v":"Undefined"},0,0,{"$f":"IF(ISBLANK($I23), \"Undefined\", IF(AM23<0.5, \"Complete\",IF(SUMPRODUCT($N$41:AM$41,$N23:AM23)<0.5, \"To start\", \"Running\")))","v":"Undefined"},0,0,{"$f":"IF(ISBLANK($I23), \"Undefined\", IF(AP23<0.5, \"Complete\",IF(SUMPRODUCT($N$41:AP$41,$N23:AP23)<0.5, \"To start\", \"Running\")))","v":"Undefined"},0,0,{"$f":"IF(ISBLANK($I23), \"Undefined\", IF(AS23<0.5, \"Complete\",IF(SUMPRODUCT($N$41:AS$41,$N23:AS23)<0.5, \"To start\", \"Running\")))","v":"Undefined"},0,0,{"$f":"IF(ISBLANK($I23), \"Undefined\", IF(AV23<0.5, \"Complete\",IF(SUMPRODUCT($N$41:AV$41,$N23:AV23)<0.5, \"To start\", \"Running\")))","v":"Undefined"},0,0,{"$f":"IF(ISBLANK($I23), \"Undefined\", IF(AY23<0.5, \"Complete\",IF(SUMPRODUCT($N$41:AY$41,$N23:AY23)<0.5, \"To start\", \"Running\")))","v":"Undefined"},0,0,{"$f":"IF(ISBLANK($I23), \"Undefined\", IF(BB23<0.5, \"Complete\",IF(SUMPRODUCT($N$41:BB$41,$N23:BB23)<0.5, \"To start\", \"Running\")))","v":"Undefined"},0,0,{"$f":"IF(ISBLANK($I23), \"Undefined\", IF(BE23<0.5, \"Complete\",IF(SUMPRODUCT($N$41:BE$41,$N23:BE23)<0.5, \"To start\", \"Running\")))","v":"Undefined"},0,0,{"$f":"IF(ISBLANK($I23), \"Undefined\", IF(BH23<0.5, \"Complete\",IF(SUMPRODUCT($N$41:BH$41,$N23:BH23)<0.5, \"To start\", \"Running\")))","v":"Undefined"},0,0,{"$f":"IF(ISBLANK($I23), \"Undefined\", IF(BK23<0.5, \"Complete\",IF(SUMPRODUCT($N$41:BK$41,$N23:BK23)<0.5, \"To start\", \"Running\")))","v":"Undefined"},0,0,{"$f":"IF(ISBLANK($I23), \"Undefined\", IF(BN23<0.5, \"Complete\",IF(SUMPRODUCT($N$41:BN$41,$N23:BN23)<0.5, \"To start\", \"Running\")))","v":"Undefined"},0,0,{"$f":"IF(ISBLANK($I23), \"Undefined\", IF(BQ23<0.5, \"Complete\",IF(SUMPRODUCT($N$41:BQ$41,$N23:BQ23)<0.5, \"To start\", \"Running\")))","v":"Undefined"},0,0,{"$f":"IF(ISBLANK($I23), \"Undefined\", IF(BT23<0.5, \"Complete\",IF(SUMPRODUCT($N$41:BT$41,$N23:BT23)<0.5, \"To start\", \"Running\")))","v":"Undefined"},0,0,{"$f":"IF(ISBLANK($I23), \"Undefined\", IF(BW23<0.5, \"Complete\",IF(SUMPRODUCT($N$41:BW$41,$N23:BW23)<0.5, \"To start\", \"Running\")))","v":"Undefined"},0,0,{"$f":"IF(ISBLANK($I23), \"Undefined\", IF(BZ23<0.5, \"Complete\",IF(SUMPRODUCT($N$41:BZ$41,$N23:BZ23)<0.5, \"To start\", \"Running\")))","v":"Undefined"},0,0,{"$f":"IF(ISBLANK($I23), \"Undefined\", IF(CC23<0.5, \"Complete\",IF(SUMPRODUCT($N$41:CC$41,$N23:CC23)<0.5, \"To start\", \"Running\")))","v":"Undefined"},0,0,{"$f":"IF(ISBLANK($I23), \"Undefined\", IF(CF23<0.5, \"Complete\",IF(SUMPRODUCT($N$41:CF$41,$N23:CF23)<0.5, \"To start\", \"Running\")))","v":"Undefined"},0,0,{"$f":"IF(ISBLANK($I23), \"Undefined\", IF(CI23<0.5, \"Complete\",IF(SUMPRODUCT($N$41:CI$41,$N23:CI23)<0.5, \"To start\", \"Running\")))","v":"Undefined"},0,0,{"$f":"IF(ISBLANK($I23), \"Undefined\", IF(CL23<0.5, \"Complete\",IF(SUMPRODUCT($N$41:CL$41,$N23:CL23)<0.5, \"To start\", \"Running\")))","v":"Undefined"},0,0,{"$f":"IF(ISBLANK($I23), \"Undefined\", IF(CO23<0.5, \"Complete\",IF(SUMPRODUCT($N$41:CO$41,$N23:CO23)<0.5, \"To start\", \"Running\")))","v":"Undefined"},0,0,{"$f":"IF(ISBLANK($I23), \"Undefined\", IF(CR23<0.5, \"Complete\",IF(SUMPRODUCT($N$41:CR$41,$N23:CR23)<0.5, \"To start\", \"Running\")))","v":"Undefined"},0,0,{"$f":"IF(ISBLANK($I23), \"Undefined\", IF(CU23<0.5, \"Complete\",IF(SUMPRODUCT($N$41:CU$41,$N23:CU23)<0.5, \"To start\", \"Running\")))","v":"Undefined"},0,0,{"$f":"IF(ISBLANK($I23), \"Undefined\", IF(CX23<0.5, \"Complete\",IF(SUMPRODUCT($N$41:CX$41,$N23:CX23)<0.5, \"To start\", \"Running\")))","v":"Undefined"},0,0,{"$f":"IF(ISBLANK($I23), \"Undefined\", IF(DA23<0.5, \"Complete\",IF(SUMPRODUCT($N$41:DA$41,$N23:DA23)<0.5, \"To start\", \"Running\")))","v":"Undefined"},0,0,{"$f":"IF(ISBLANK($I23), \"Undefined\", IF(DD23<0.5, \"Complete\",IF(SUMPRODUCT($N$41:DD$41,$N23:DD23)<0.5, \"To start\", \"Running\")))","v":"Undefined"},0,0,{"$f":"IF(ISBLANK($I23), \"Undefined\", IF(DG23<0.5, \"Complete\",IF(SUMPRODUCT($N$41:DG$41,$N23:DG23)<0.5, \"To start\", \"Running\")))","v":"Undefined"},0,0,{"$f":"IF(ISBLANK($I23), \"Undefined\", IF(DJ23<0.5, \"Complete\",IF(SUMPRODUCT($N$41:DJ$41,$N23:DJ23)<0.5, \"To start\", \"Running\")))","v":"Undefined"},0,0,{"$f":"IF(ISBLANK($I23), \"Undefined\", IF(DM23<0.5, \"Complete\",IF(SUMPRODUCT($N$41:DM$41,$N23:DM23)<0.5, \"To start\", \"Running\")))","v":"Undefined"},0,0,{"$f":"IF(ISBLANK($I23), \"Undefined\", IF(DP23<0.5, \"Complete\",IF(SUMPRODUCT($N$41:DP$41,$N23:DP23)<0.5, \"To start\", \"Running\")))","v":"Undefined"},0,0,{"$f":"IF(ISBLANK($I23), \"Undefined\", IF(DS23<0.5, \"Complete\",IF(SUMPRODUCT($N$41:DS$41,$N23:DS23)<0.5, \"To start\", \"Running\")))","v":"Undefined"},0,0,{"$f":"IF(ISBLANK($I23), \"Undefined\", IF(DV23<0.5, \"Complete\",IF(SUMPRODUCT($N$41:DV$41,$N23:DV23)<0.5, \"To start\", \"Running\")))","v":"Undefined"},0,0,{"$f":"IF(ISBLANK($I23), \"Undefined\", IF(DY23<0.5, \"Complete\",IF(SUMPRODUCT($N$41:DY$41,$N23:DY23)<0.5, \"To start\", \"Running\")))","v":"Undefined"},0,0,{"$f":"IF(ISBLANK($I23), \"Undefined\", IF(EB23<0.5, \"Complete\",IF(SUMPRODUCT($N$41:EB$41,$N23:EB23)<0.5, \"To start\", \"Running\")))","v":"Undefined"},null,{"$f":"SUMPRODUCT($L$41:DK$41,$L23:DK23)","v":0},0,{"$f":"OFFSET($O23,0,(Capacity!$F$2-SprintStart)*3,1,1)","v":0},0,0,0,"",0,0]
[{"$nulls":10},{"$f":"IF(SprintStart>Capacity!$F$2, \"To start\", INDEX(Burndown,ROW(K24)-ROW(K$6),MIN(Capacity!$F$2-SprintStart,29)*3+3))","v":"Undefined"},null,0,0,0,{"$f":"IF(ISBLANK($I24), \"Undefined\", IF(O24<0.5, \"Complete\",IF(SUMPRODUCT($N$41:O$41,$N24:O24)<0.5, \"To start\", \"Running\")))","v":"Undefined"},0,0,{"$f":"IF(ISBLANK($I24), \"Undefined\", IF(R24<0.5, \"Complete\",IF(SUMPRODUCT($N$41:R$41,$N24:R24)<0.5, \"To start\", \"Running\")))","v":"Undefined"},0,0,{"$f":"IF(ISBLANK($I24), \"Undefined\", IF(U24<0.5, \"Complete\",IF(SUMPRODUCT($N$41:U$41,$N24:U24)<0.5, \"To start\", \"Running\")))","v":"Undefined"},0,0,{"$f":"IF(ISBLANK($I24), \"Undefined\", IF(X24<0.5, \"Complete\",IF(SUMPRODUCT($N$41:X$41,$N24:X24)<0.5, \"To start\", \"Running\")))","v":"Undefined"},0,0,{"$f":"IF(ISBLANK($I24), \"Undefined\", IF(AA24<0.5, \"Complete\",IF(SUMPRODUCT($N$41:AA$41,$N24:AA24)<0.5, \"To start\", \"Running\")))","v":"Undefined"},0,0,{"$f":"IF(ISBLANK($I24), \"Undefined\", IF(AD24<0.5, \"Complete\",IF(SUMPRODUCT($N$41:AD$41,$N24:AD24)<0.5, \"To start\", \"Running\")))","v":"Undefined"},0,0,{"$f":"IF(ISBLANK($I24), \"Undefined\", IF(AG24<0.5, \"Complete\",IF(SUMPRODUCT($N$41:AG$41,$N24:AG24)<0.5, \"To start\", \"Running\")))","v":"Undefined"},0,0,{"$f":"IF(ISBLANK($I24), \"Undefined\", IF(AJ24<0.5, \"Complete\",IF(SUMPRODUCT($N$41:AJ$41,$N24:AJ24)<0.5, \"To start\", \"Running\")))","v":"Undefined"},0,0,{"$f":"IF(ISBLANK($I24), \"Undefined\", IF(AM24<0.5, \"Complete\",IF(SUMPRODUCT($N$41:AM$41,$N24:AM24)<0.5, \"To start\", \"Running\")))","v":"Undefined"},0,0,{"$f":"IF(ISBLANK($I24), \"Undefined\", IF(AP24<0.5, \"Complete\",IF(SUMPRODUCT($N$41:AP$41,$N24:AP24)<0.5, \"To start\", \"Running\")))","v":"Undefined"},0,0,{"$f":"IF(ISBLANK($I24), \"Undefined\", IF(AS24<0.5, \"Complete\",IF(SUMPRODUCT($N$41:AS$41,$N24:AS24)<0.5, \"To start\", \"Running\")))","v":"Undefined"},0,0,{"$f":"IF(ISBLANK($I24), \"Undefined\", IF(AV24<0.5, \"Complete\",IF(SUMPRODUCT($N$41:AV$41,$N24:AV24)<0.5, \"To start\", \"Running\")))","v":"Undefined"},0,0,{"$f":"IF(ISBLANK($I24), \"Undefined\", IF(AY24<0.5, \"Complete\",IF(SUMPRODUCT($N$41:AY$41,$N24:AY24)<0.5, \"To start\", \"Running\")))","v":"Undefined"},0,0,{"$f":"IF(ISBLANK($I24), \"Undefined\", IF(BB24<0.5, \"Complete\",IF(SUMPRODUCT($N$41:BB$41,$N24:BB24)<0.5, \"To start\", \"Running\")))","v":"Undefined"},0,0,{"$f":"IF(ISBLANK($I24), \"Undefined\", IF(BE24<0.5, \"Complete\",IF(SUMPRODUCT($N$41:BE$41,$N24:BE24)<0.5, \"To start\", \"Running\")))","v":"Undefined"},0,0,{"$f":"IF(ISBLANK($I24), \"Undefined\", IF(BH24<0.5, \"Complete\",IF(SUMPRODUCT($N$41:BH$41,$N24:BH24)<0.5, \"To start\", \"Running\")))","v":"Undefined"},0,0,{"$f":"IF(ISBLANK($I24), \"Undefined\", IF(BK24<0.5, \"Complete\",IF(SUMPRODUCT($N$41:BK$41,$N24:BK24)<0.5, \"To start\", \"Running\")))","v":"Undefined"},0,0,{"$f":"IF(ISBLANK($I24), \"Undefined\", IF(BN24<0.5, \"Complete\",IF(SUMPRODUCT($N$41:BN$41,$N24:BN24)<0.5, \"To start\", \"Running\")))","v":"Undefined"},0,0,{"$f":"IF(ISBLANK($I24), \"Undefined\", IF(BQ24<0.5, \"Complete\",IF(SUMPRODUCT($N$41:BQ$41,$N24:BQ24)<0.5, \"To start\", \"Running\")))","v":"Undefined"},0,0,{"$f":"IF(ISBLANK($I24), \"Undefined\", IF(BT24<0.5, \"Complete\",IF(SUMPRODUCT($N$41:BT$41,$N24:BT24)<0.5, \"To start\", \"Running\")))","v":"Undefined"},0,0,{"$f":"IF(ISBLANK($I24), \"Undefined\", IF(BW24<0.5, \"Complete\",IF(SUMPRODUCT($N$41:BW$41,$N24:BW24)<0.5, \"To start\", \"Running\")))","v":"Undefined"},0,0,{"$f":"IF(ISBLANK($I24), \"Undefined\", IF(BZ24<0.5, \"Complete\",IF(SUMPRODUCT($N$41:BZ$41,$N24:BZ24)<0.5, \"To start\", \"Running\")))","v":"Undefined"},0,0,{"$f":"IF(ISBLANK($I24), \"Undefined\", IF(CC24<0.5, \"Complete\",IF(SUMPRODUCT($N$41:CC$41,$N24:CC24)<0.5, \"To start\", \"Running\")))","v":"Undefined"},0,0,{"$f":"IF(ISBLANK($I24), \"Undefined\", IF(CF24<0.5, \"Complete\",IF(SUMPRODUCT($N$41:CF$41,$N24:CF24)<0.5, \"To start\", \"Running\")))","v":"Undefined"},0,0,{"$f":"IF(ISBLANK($I24), \"Undefined\", IF(CI24<0.5, \"Complete\",IF(SUMPRODUCT($N$41:CI$41,$N24:CI24)<0.5, \"To start\", \"Running\")))","v":"Undefined"},0,0,{"$f":"IF(ISBLANK($I24), \"Undefined\", IF(CL24<0.5, \"Complete\",IF(SUMPRODUCT($N$41:CL$41,$N24:CL24)<0.5, \"To start\", \"Running\")))","v":"Undefined"},0,0,{"$f":"IF(ISBLANK($I24), \"Undefined\", IF(CO24<0.5, \"Complete\",IF(SUMPRODUCT($N$41:CO$41,$N24:CO24)<0.5, \"To start\", \"Running\")))","v":"Undefined"},0,0,{"$f":"IF(ISBLANK($I24), \"Undefined\", IF(CR24<0.5, \"Complete\",IF(SUMPRODUCT($N$41:CR$41,$N24:CR24)<0.5, \"To start\", \"Running\")))","v":"Undefined"},0,0,{"$f":"IF(ISBLANK($I24), \"Undefined\", IF(CU24<0.5, \"Complete\",IF(SUMPRODUCT($N$41:CU$41,$N24:CU24)<0.5, \"To start\", \"Running\")))","v":"Undefined"},0,0,{"$f":"IF(ISBLANK($I24), \"Undefined\", IF(CX24<0.5, \"Complete\",IF(SUMPRODUCT($N$41:CX$41,$N24:CX24)<0.5, \"To start\", \"Running\")))","v":"Undefined"},0,0,{"$f":"IF(ISBLANK($I24), \"Undefined\", IF(DA24<0.5, \"Complete\",IF(SUMPRODUCT($N$41:DA$41,$N24:DA24)<0.5, \"To start\", \"Running\")))","v":"Undefined"},0,0,{"$f":"IF(ISBLANK($I24), \"Undefined\", IF(DD24<0.5, \"Complete\",IF(SUMPRODUCT($N$41:DD$41,$N24:DD24)<0.5, \"To start\", \"Running\")))","v":"Undefined"},0,0,{"$f":"IF(ISBLANK($I24), \"Undefined\", IF(DG24<0.5, \"Complete\",IF(SUMPRODUCT($N$41:DG$41,$N24:DG24)<0.5, \"To start\", \"Running\")))","v":"Undefined"},0,0,{"$f":"IF(ISBLANK($I24), \"Undefined\", IF(DJ24<0.5, \"Complete\",IF(SUMPRODUCT($N$41:DJ$41,$N24:DJ24)<0.5, \"To start\", \"Running\")))","v":"Undefined"},0,0,{"$f":"IF(ISBLANK($I24), \"Undefined\", IF(DM24<0.5, \"Complete\",IF(SUMPRODUCT($N$41:DM$41,$N24:DM24)<0.5, \"To start\", \"Running\")))","v":"Undefined"},0,0,{"$f":"IF(ISBLANK($I24), \"Undefined\", IF(DP24<0.5, \"Complete\",IF(SUMPRODUCT($N$41:DP$41,$N24:DP24)<0.5, \"To start\", \"Running\")))","v":"Undefined"},0,0,{"$f":"IF(ISBLANK($I24), \"Undefined\", IF(DS24<0.5, \"Complete\",IF(SUMPRODUCT($N$41:DS$41,$N24:DS24)<0.5, \"To start\", \"Running\")))","v":"Undefined"},0,0,{"$f":"IF(ISBLANK($I24), \"Undefined\", IF(DV24<0.5, \"Complete\",IF(SUMPRODUCT($N$41:DV$41,$N24:DV24)<0.5, \"To start\", \"Running\")))","v":"Undefined"},0,0,{"$f":"IF(ISBLANK($I24), \"Undefined\", IF(DY24<0.5, \"Complete\",IF(SUMPRODUCT($N$41:DY$41,$N24:DY24)<0.5, \"To start\", \"Running\")))","v":"Undefined"},0,0,{"$f":"IF(ISBLANK($I24), \"Undefined\", IF(EB24<0.5, \"Complete\",IF(SUMPRODUCT($N$41:EB$41,$N24:EB24)<0.5, \"To start\", \"Running\")))","v":"Undefined"},null,{"$f":"SUMPRODUCT($L$41:DK$41,$L24:DK24)","v":0},0,{"$f":"OFFSET($O24,0,(Capacity!$F$2-SprintStart)*3,1,1)","v":0},0,0,0,"",0,0]
[{"$nulls":10},{"$f":"IF(SprintStart>Capacity!$F$2, \"To start\", INDEX(Burndown,ROW(K25)-ROW(K$6),MIN(Capacity!$F$2-SprintStart,29)*3+3))","v":"Undefined"},null,0,0,0,{"$f":"IF(ISBLANK($I25), \"Undefined\", IF(O25<0.5, \"Complete\",IF(SUMPRODUCT($N$41:O$41,$N25:O25)<0.5, \"To start\", \"Running\")))","v":"Undefined"},0,0,{"$f":"IF(ISBLANK($I25), \"Undefined\", IF(R25<0.5, \"Complete\",IF(SUMPRODUCT($N$41:R$41,$N25:R25)<0.5, \"To start\", \"Running\")))","v":"Undefined"},0,0,{"$f":"IF(ISBLANK($I25), \"Undefined\", IF(U25<0.5, \"Complete\",IF(SUMPRODUCT($N$41:U$41,$N25:U25)<0.5, \"To start\", \"Running\")))","v":"Undefined"},0,0,{"$f":"IF(ISBLANK($I25), \"Undefined\", IF(X25<0.5, \"Complete\",IF(SUMPRODUCT($N$41:X$41,$N25:X25)<0.5, \"To start\", \"Running\")))","v":"Undefined"},0,0,{"$f":"IF(ISBLANK($I25), \"Undefined\", IF(AA25<0.5, \"Complete\",IF(SUMPRODUCT($N$41:AA$41,$N25:AA25)<0.5, \"To start\", \"Running\")))","v":"Undefined"},0,0,{"$f":"IF(ISBLANK($I25), \"Undefined\", IF(AD25<0.5, \"Complete\",IF(SUMPRODUCT($N$41:AD$41,$N25:AD25)<0.5, \"To start\", \"Running\")))","v":"Undefined"},0,0,{"$f":"IF(ISBLANK($I25), \"Undefined\", IF(AG25<0.5, \"Complete\",IF(SUMPRODUCT($N$41:AG$41,$N25:AG25)<0.5, \"To start\", \"Running\")))","v":"Undefined"},0,0,{"$f":"IF(ISBLANK($I25), \"Undefined\", IF(AJ25<0.5, \"Complete\",IF(SUMPRODUCT($N$41:AJ$41,$N25:AJ25)<0.5, \"To start\", \"Running\")))","v":"Undefined"},0,0,{"$f":"IF(ISBLANK($I25), \"Undefined\", IF(AM25<0.5, \"Complete\",IF(SUMPRODUCT($N$41:AM$41,$N25:AM25)<0.5, \"To start\", \"Running\")))","v":"Undefined"},0,0,{"$f":"IF(ISBLANK($I25), \"Undefined\", IF(AP25<0.5, \"Complete\",IF(SUMPRODUCT($N$41:AP$41,$N25:AP25)<0.5, \"To start\", \"Running\")))","v":"Undefined"},0,0,{"$f":"IF(ISBLANK($I25), \"Undefined\", IF(AS25<0.5, \"Complete\",IF(SUMPRODUCT($N$41:AS$41,$N25:AS25)<0.5, \"To start\", \"Running\")))","v":"Undefined"},0,0,{"$f":"IF(ISBLANK($I25), \"Undefined\", IF(AV25<0.5, \"Complete\",IF(SUMPRODUCT($N$41:AV$41,$N25:AV25)<0.5, \"To start\", \"Running\")))","v":"Undefined"},0,0,{"$f":"IF(ISBLANK($I25), \"Undefined\", IF(AY25<0.5, \"Complete\",IF(SUMPRODUCT($N$41:AY$41,$N25:AY25)<0.5, \"To start\", \"Running\")))","v":"Undefined"},0,0,{"$f":"IF(ISBLANK($I25), \"Undefined\", IF(BB25<0.5, \"Complete\",IF(SUMPRODUCT($N$41:BB$41,$N25:BB25)<0.5, \"To start\", \"Running\")))","v":"Undefined"},0,0,{"$f":"IF(ISBLANK($I25), \"Undefined\", IF(BE25<0.5, \"Complete\",IF(SUMPRODUCT($N$41:BE$41,$N25:BE25)<0.5, \"To start\", \"Running\")))","v":"Undefined"},0,0,{"$f":"IF(ISBLANK($I25), \"Undefined\", IF(BH25<0.5, \"Complete\",IF(SUMPRODUCT($N$41:BH$41,$N25:BH25)<0.5, \"To start\", \"Running\")))","v":"Undefined"},0,0,{"$f":"IF(ISBLANK($I25), \"Undefined\", IF(BK25<0.5, \"Complete\",IF(SUMPRODUCT($N$41:BK$41,$N25:BK25)<0.5, \"To start\", \"Running\")))","v":"Undefined"},0,0,{"$f":"IF(ISBLANK($I25), \"Undefined\", IF(BN25<0.5, \"Complete\",IF(SUMPRODUCT($N$41:BN$41,$N25:BN25)<0.5, \"To start\", \"Running\")))","v":"Undefined"},0,0,{"$f":"IF(ISBLANK($I25), \"Undefined\", IF(BQ25<0.5, \"Complete\",IF(SUMPRODUCT($N$41:BQ$41,$N25:BQ25)<0.5, \"To start\", \"Running\")))","v":"Undefined"},0,0,{"$f":"IF(ISBLANK($I25), \"Undefined\", IF(BT25<0.5, \"Complete\",IF(SUMPRODUCT($N$41:BT$41,$N25:BT25)<0.5, \"To start\", \"Running\")))","v":"Undefined"},0,0,{"$f":"IF(ISBLANK($I25), \"Undefined\", IF(BW25<0.5, \"Complete\",IF(SUMPRODUCT($N$41:BW$41,$N25:BW25)<0.5, \"To start\", \"Running\")))","v":"Undefined"},0,0,{"$f":"IF(ISBLANK($I25), \"Undefined\", IF(BZ25<0.5, \"Complete\",IF(SUMPRODUCT($N$41:BZ$41,$N25:BZ25)<0.5, \"To start\", \"Running\")))","v":"Undefined"},0,0,{"$f":"IF(ISBLANK($I25), \"Undefined\", IF(CC25<0.5, \"Complete\",IF(SUMPRODUCT($N$41:CC$41,$N25:CC25)<0.5, \"To start\", \"Running\")))","v":"Undefined"},0,0,{"$f":"IF(ISBLANK($I25), \"Undefined\", IF(CF25<0.5, \"Complete\",IF(SUMPRODUCT($N$41:CF$41,$N25:CF25)<0.5, \"To start\", \"Running\")))","v":"Undefined"},0,0,{"$f":"IF(ISBLANK($I25), \"Undefined\", IF(CI25<0.5, \"Complete\",IF(SUMPRODUCT($N$41:CI$41,$N25:CI25)<0.5, \"To start\", \"Running\")))","v":"Undefined"},0,0,{"$f":"IF(ISBLANK($I25), \"Undefined\", IF(CL25<0.5, \"Complete\",IF(SUMPRODUCT($N$41:CL$41,$N25:CL25)<0.5, \"To start\", \"Running\")))","v":"Undefined"},0,0,{"$f":"IF(ISBLANK($I25), \"Undefined\", IF(CO25<0.5, \"Complete\",IF(SUMPRODUCT($N$41:CO$41,$N25:CO25)<0.5, \"To start\", \"Running\")))","v":"Undefined"},0,0,{"$f":"IF(ISBLANK($I25), \"Undefined\", IF(CR25<0.5, \"Complete\",IF(SUMPRODUCT($N$41:CR$41,$N25:CR25)<0.5, \"To start\", \"Running\")))","v":"Undefined"},0,0,{"$f":"IF(ISBLANK($I25), \"Undefined\", IF(CU25<0.5, \"Complete\",IF(SUMPRODUCT($N$41:CU$41,$N25:CU25)<0.5, \"To start\", \"Running\")))","v":"Undefined"},0,0,{"$f":"IF(ISBLANK($I25), \"Undefined\", IF(CX25<0.5, \"Complete\",IF(SUMPRODUCT($N$41:CX$41,$N25:CX25)<0.5, \"To start\", \"Running\")))","v":"Undefined"},0,0,{"$f":"IF(ISBLANK($I25), \"Undefined\", IF(DA25<0.5, \"Complete\",IF(SUMPRODUCT($N$41:DA$41,$N25:DA25)<0.5, \"To start\", \"Running\")))","v":"Undefined"},0,0,{"$f":"IF(ISBLANK($I25), \"Undefined\", IF(DD25<0.5, \"Complete\",IF(SUMPRODUCT($N$41:DD$41,$N25:DD25)<0.5, \"To start\", \"Running\")))","v":"Undefined"},0,0,{"$f":"IF(ISBLANK($I25), \"Undefined\", IF(DG25<0.5, \"Complete\",IF(SUMPRODUCT($N$41:DG$41,$N25:DG25)<0.5, \"To start\", \"Running\")))","v":"Undefined"},0,0,{"$f":"IF(ISBLANK($I25), \"Undefined\", IF(DJ25<0.5, \"Complete\",IF(SUMPRODUCT($N$41:DJ$41,$N25:DJ25)<0.5, \"To start\", \"Running\")))","v":"Undefined"},0,0,{"$f":"IF(ISBLANK($I25), \"Undefined\", IF(DM25<0.5, \"Complete\",IF(SUMPRODUCT($N$41:DM$41,$N25:DM25)<0.5, \"To start\", \"Running\")))","v":"Undefined"},0,0,{"$f":"IF(ISBLANK($I25), \"Undefined\", IF(DP25<0.5, \"Complete\",IF(SUMPRODUCT($N$41:DP$41,$N25:DP25)<0.5, \"To start\", \"Running\")))","v":"Undefined"},0,0,{"$f":"IF(ISBLANK($I25), \"Undefined\", IF(DS25<0.5, \"Complete\",IF(SUMPRODUCT($N$41:DS$41,$N25:DS25)<0.5, \"To start\", \"Running\")))","v":"Undefined"},0,0,{"$f":"IF(ISBLANK($I25), \"Undefined\", IF(DV25<0.5, \"Complete\",IF(SUMPRODUCT($N$41:DV$41,$N25:DV25)<0.5, \"To start\", \"Running\")))","v":"Undefined"},0,0,{"$f":"IF(ISBLANK($I25), \"Undefined\", IF(DY25<0.5, \"Complete\",IF(SUMPRODUCT($N$41:DY$41,$N25:DY25)<0.5, \"To start\", \"Running\")))","v":"Undefined"},0,0,{"$f":"IF(ISBLANK($I25), \"Undefined\", IF(EB25<0.5, \"Complete\",IF(SUMPRODUCT($N$41:EB$41,$N25:EB25)<0.5, \"To start\", \"Running\")))","v":"Undefined"},null,{"$f":"SUMPRODUCT($L$41:DK$41,$L25:DK25)","v":0},0,{"$f":"OFFSET($O25,0,(Capacity!$F$2-SprintStart)*3,1,1)","v":0},0,0,0,"",0,0]
[{"$nulls":10},{"$f":"IF(SprintStart>Capacity!$F$2, \"To start\", INDEX(Burndown,ROW(K26)-ROW(K$6),MIN(Capacity!$F$2-SprintStart,29)*3+3))","v":"Undefined"},null,0,0,0,{"$f":"IF(ISBLANK($I26), \"Undefined\", IF(O26<0.5, \"Complete\",IF(SUMPRODUCT($N$41:O$41,$N26:O26)<0.5, \"To start\", \"Running\")))","v":"Undefined"},0,0,{"$f":"IF(ISBLANK($I26), \"Undefined\", IF(R26<0.5, \"Complete\",IF(SUMPRODUCT($N$41:R$41,$N26:R26)<0.5, \"To start\", \"Running\")))","v":"Undefined"},0,0,{"$f":"IF(ISBLANK($I26), \"Undefined\", IF(U26<0.5, \"Complete\",IF(SUMPRODUCT($N$41:U$41,$N26:U26)<0.5, \"To start\", \"Running\")))","v":"Undefined"},0,0,{"$f":"IF(ISBLANK($I26), \"Undefined\", IF(X26<0.5, \"Complete\",IF(SUMPRODUCT($N$41:X$41,$N26:X26)<0.5, \"To start\", \"Running\")))","v":"Undefined"},0,0,{"$f":"IF(ISBLANK($I26), \"Undefined\", IF(AA26<0.5, \"Complete\",IF(SUMPRODUCT($N$41:AA$41,$N26:AA26)<0.5, \"To start\", \"Running\")))","v":"Undefined"},0,0,{"$f":"IF(ISBLANK($I26), \"Undefined\", IF(AD26<0.5, \"Complete\",IF(SUMPRODUCT($N$41:AD$41,$N26:AD26)<0.5, \"To start\", \"Running\")))","v":"Undefined"},0,0,{"$f":"IF(ISBLANK($I26), \"Undefined\", IF(AG26<0.5, \"Complete\",IF(SUMPRODUCT($N$41:AG$41,$N26:AG26)<0.5, \"To start\", \"Running\")))","v":"Undefined"},0,0,{"$f":"IF(ISBLANK($I26), \"Undefined\", IF(AJ26<0.5, \"Complete\",IF(SUMPRODUCT($N$41:AJ$41,$N26:AJ26)<0.5, \"To start\", \"Running\")))","v":"Undefined"},0,0,{"$f":"IF(ISBLANK($I26), \"Undefined\", IF(AM26<0.5, \"Complete\",IF(SUMPRODUCT($N$41:AM$41,$N26:AM26)<0.5, \"To start\", \"Running\")))","v":"Undefined"},0,0,{"$f":"IF(ISBLANK($I26), \"Undefined\", IF(AP26<0.5, \"Complete\",IF(SUMPRODUCT($N$41:AP$41,$N26:AP26)<0.5, \"To start\", \"Running\")))","v":"Undefined"},0,0,{"$f":"IF(ISBLANK($I26), \"Undefined\", IF(AS26<0.5, \"Complete\",IF(SUMPRODUCT($N$41:AS$41,$N26:AS26)<0.5, \"To start\", \"Running\")))","v":"Undefined"},0,0,{"$f":"IF(ISBLANK($I26), \"Undefined\", IF(AV26<0.5, \"Complete\",IF(SUMPRODUCT($N$41:AV$41,$N26:AV26)<0.5, \"To start\", \"Running\")))","v":"Undefined"},0,0,{"$f":"IF(ISBLANK($I26), \"Undefined\", IF(AY26<0.5, \"Complete\",IF(SUMPRODUCT($N$41:AY$41,$N26:AY26)<0.5, \"To start\", \"Running\")))","v":"Undefined"},0,0,{"$f":"IF(ISBLANK($I26), \"Undefined\", IF(BB26<0.5, \"Complete\",IF(SUMPRODUCT($N$41:BB$41,$N26:BB26)<0.5, \"To start\", \"Running\")))","v":"Undefined"},0,0,{"$f":"IF(ISBLANK($I26), \"Undefined\", IF(BE26<0.5, \"Complete\",IF(SUMPRODUCT($N$41:BE$41,$N26:BE26)<0.5, \"To start\", \"Running\")))","v":"Undefined"},0,0,{"$f":"IF(ISBLANK($I26), \"Undefined\", IF(BH26<0.5, \"Complete\",IF(SUMPRODUCT($N$41:BH$41,$N26:BH26)<0.5, \"To start\", \"Running\")))","v":"Undefined"},0,0,{"$f":"IF(ISBLANK($I26), \"Undefined\", IF(BK26<0.5, \"Complete\",IF(SUMPRODUCT($N$41:BK$41,$N26:BK26)<0.5, \"To start\", \"Running\")))","v":"Undefined"},0,0,{"$f":"IF(ISBLANK($I26), \"Undefined\", IF(BN26<0.5, \"Complete\",IF(SUMPRODUCT($N$41:BN$41,$N26:BN26)<0.5, \"To start\", \"Running\")))","v":"Undefined"},0,0,{"$f":"IF(ISBLANK($I26), \"Undefined\", IF(BQ26<0.5, \"Complete\",IF(SUMPRODUCT($N$41:BQ$41,$N26:BQ26)<0.5, \"To start\", \"Running\")))","v":"Undefined"},0,0,{"$f":"IF(ISBLANK($I26), \"Undefined\", IF(BT26<0.5, \"Complete\",IF(SUMPRODUCT($N$41:BT$41,$N26:BT26)<0.5, \"To start\", \"Running\")))","v":"Undefined"},0,0,{"$f":"IF(ISBLANK($I26), \"Undefined\", IF(BW26<0.5, \"Complete\",IF(SUMPRODUCT($N$41:BW$41,$N26:BW26)<0.5, \"To start\", \"Running\")))","v":"Undefined"},0,0,{"$f":"IF(ISBLANK($I26), \"Undefined\", IF(BZ26<0.5, \"Complete\",IF(SUMPRODUCT($N$41:BZ$41,$N26:BZ26)<0.5, \"To start\", \"Running\")))","v":"Undefined"},0,0,{"$f":"IF(ISBLANK($I26), \"Undefined\", IF(CC26<0.5, \"Complete\",IF(SUMPRODUCT($N$41:CC$41,$N26:CC26)<0.5, \"To start\", \"Running\")))","v":"Undefined"},0,0,{"$f":"IF(ISBLANK($I26), \"Undefined\", IF(CF26<0.5, \"Complete\",IF(SUMPRODUCT($N$41:CF$41,$N26:CF26)<0.5, \"To start\", \"Running\")))","v":"Undefined"},0,0,{"$f":"IF(ISBLANK($I26), \"Undefined\", IF(CI26<0.5, \"Complete\",IF(SUMPRODUCT($N$41:CI$41,$N26:CI26)<0.5, \"To start\", \"Running\")))","v":"Undefined"},0,0,{"$f":"IF(ISBLANK($I26), \"Undefined\", IF(CL26<0.5, \"Complete\",IF(SUMPRODUCT($N$41:CL$41,$N26:CL26)<0.5, \"To start\", \"Running\")))","v":"Undefined"},0,0,{"$f":"IF(ISBLANK($I26), \"Undefined\", IF(CO26<0.5, \"Complete\",IF(SUMPRODUCT($N$41:CO$41,$N26:CO26)<0.5, \"To start\", \"Running\")))","v":"Undefined"},0,0,{"$f":"IF(ISBLANK($I26), \"Undefined\", IF(CR26<0.5, \"Complete\",IF(SUMPRODUCT($N$41:CR$41,$N26:CR26)<0.5, \"To start\", \"Running\")))","v":"Undefined"},0,0,{"$f":"IF(ISBLANK($I26), \"Undefined\", IF(CU26<0.5, \"Complete\",IF(SUMPRODUCT($N$41:CU$41,$N26:CU26)<0.5, \"To start\", \"Running\")))","v":"Undefined"},0,0,{"$f":"IF(ISBLANK($I26), \"Undefined\", IF(CX26<0.5, \"Complete\",IF(SUMPRODUCT($N$41:CX$41,$N26:CX26)<0.5, \"To start\", \"Running\")))","v":"Undefined"},0,0,{"$f":"IF(ISBLANK($I26), \"Undefined\", IF(DA26<0.5, \"Complete\",IF(SUMPRODUCT($N$41:DA$41,$N26:DA26)<0.5, \"To start\", \"Running\")))","v":"Undefined"},0,0,{"$f":"IF(ISBLANK($I26), \"Undefined\", IF(DD26<0.5, \"Complete\",IF(SUMPRODUCT($N$41:DD$41,$N26:DD26)<0.5, \"To start\", \"Running\")))","v":"Undefined"},0,0,{"$f":"IF(ISBLANK($I26), \"Undefined\", IF(DG26<0.5, \"Complete\",IF(SUMPRODUCT($N$41:DG$41,$N26:DG26)<0.5, \"To start\", \"Running\")))","v":"Undefined"},0,0,{"$f":"IF(ISBLANK($I26), \"Undefined\", IF(DJ26<0.5, \"Complete\",IF(SUMPRODUCT($N$41:DJ$41,$N26:DJ26)<0.5, \"To start\", \"Running\")))","v":"Undefined"},0,0,{"$f":"IF(ISBLANK($I26), \"Undefined\", IF(DM26<0.5, \"Complete\",IF(SUMPRODUCT($N$41:DM$41,$N26:DM26)<0.5, \"To start\", \"Running\")))","v":"Undefined"},0,0,{"$f":"IF(ISBLANK($I26), \"Undefined\", IF(DP26<0.5, \"Complete\",IF(SUMPRODUCT($N$41:DP$41,$N26:DP26)<0.5, \"To start\", \"Running\")))","v":"Undefined"},0,0,{"$f":"IF(ISBLANK($I26), \"Undefined\", IF(DS26<0.5, \"Complete\",IF(SUMPRODUCT($N$41:DS$41,$N26:DS26)<0.5, \"To start\", \"Running\")))","v":"Undefined"},0,0,{"$f":"IF(ISBLANK($I26), \"Undefined\", IF(DV26<0.5, \"Complete\",IF(SUMPRODUCT($N$41:DV$41,$N26:DV26)<0.5, \"To start\", \"Running\")))","v":"Undefined"},0,0,{"$f":"IF(ISBLANK($I26), \"Undefined\", IF(DY26<0.5, \"Complete\",IF(SUMPRODUCT($N$41:DY$41,$N26:DY26)<0.5, \"To start\", \"Running\")))","v":"Undefined"},0,0,{"$f":"IF(ISBLANK($I26), \"Undefined\", IF(EB26<0.5, \"Complete\",IF(SUMPRODUCT($N$41:EB$41,$N26:EB26)<0.5, \"To start\", \"Running\")))","v":"Undefined"},null,{"$f":"SUMPRODUCT($L$41:DK$41,$L26:DK26)","v":0},0,{"$f":"OFFSET($O26,0,(Capacity!$F$2-SprintStart)*3,1,1)","v":0},0,0,0,"",0,0]
[{"$nulls":10},{"$f":"IF(SprintStart>Capacity!$F$2, \"To start\", INDEX(Burndown,ROW(K27)-ROW(K$6),MIN(Capacity!$F$2-SprintStart,29)*3+3))","v":"Undefined"},null,0,0,{"$f":"MAX(M27-N27,0)","v":0},{"$f":"IF(ISBLANK($I27), \"Undefined\", IF(O27<0.5, \"Complete\",IF(SUMPRODUCT($N$41:O$41,$N27:O27)<0.5, \"To start\", \"Running\")))","v":"Undefined"},0,{"$f":"MAX(O27-Q27,0)","v":0},{"$f":"IF(ISBLANK($I27), \"Undefined\", IF(R27<0.5, \"Complete\",IF(SUMPRODUCT($N$41:R$41,$N27:R27)<0.5, \"To start\", \"Running\")))","v":"Undefined"},0,{"$f":"MAX(R27-T27,0)","v":0},{"$f":"IF(ISBLANK($I27), \"Undefined\", IF(U27<0.5, \"Complete\",IF(SUMPRODUCT($N$41:U$41,$N27:U27)<0.5, \"To start\", \"Running\")))","v":"Undefined"},0,{"$f":"MAX(U27-W27,0)","v":0},{"$f":"IF(ISBLANK($I27), \"Undefined\", IF(X27<0.5, \"Complete\",IF(SUMPRODUCT($N$41:X$41,$N27:X27)<0.5, \"To start\", \"Running\")))","v":"Undefined"},0,{"$f":"MAX(X27-Z27,0)","v":0},{"$f":"IF(ISBLANK($I27), \"Undefined\", IF(AA27<0.5, \"Complete\",IF(SUMPRODUCT($N$41:AA$41,$N27:AA27)<0.5, \"To start\", \"Running\")))","v":"Undefined"},0,{"$f":"MAX(AA27-AC27,0)","v":0},{"$f":"IF(ISBLANK($I27), \"Undefined\", IF(AD27<0.5, \"Complete\",IF(SUMPRODUCT($N$41:AD$41,$N27:AD27)<0.5, \"To start\", \"Running\")))","v":"Undefined"},0,{"$f":"MAX(AD27-AF27,0)","v":0},{"$f":"IF(ISBLANK($I27), \"Undefined\", IF(AG27<0.5, \"Complete\",IF(SUMPRODUCT($N$41:AG$41,$N27:AG27)<0.5, \"To start\", \"Running\")))","v":"Undefined"},0,{"$f":"MAX(AG27-AI27,0)","v":0},{"$f":"IF(ISBLANK($I27), \"Undefined\", IF(AJ27<0.5, \"Complete\",IF(SUMPRODUCT($N$41:AJ$41,$N27:AJ27)<0.5, \"To start\", \"Running\")))","v":"Undefined"},0,{"$f":"MAX(AJ27-AL27,0)","v":0},{"$f":"IF(ISBLANK($I27), \"Undefined\", IF(AM27<0.5, \"Complete\",IF(SUMPRODUCT($N$41:AM$41,$N27:AM27)<0.5, \"To start\", \"Running\")))","v":"Undefined"},0,{"$f":"MAX(AM27-AO27,0)","v":0},{"$f":"IF(ISBLANK($I27), \"Undefined\", IF(AP27<0.5, \"Complete\",IF(SUMPRODUCT($N$41:AP$41,$N27:AP27)<0.5, \"To start\", \"Running\")))","v":"Undefined"},0,{"$f":"MAX(AP27-AR27,0)","v":0},{"$f":"IF(ISBLANK($I27), \"Undefined\", IF(AS27<0.5, \"Complete\",IF(SUMPRODUCT($N$41:AS$41,$N27:AS27)<0.5, \"To start\", \"Running\")))","v":"Undefined"},0,{"$f":"MAX(AS27-AU27,0)","v":0},{"$f":"IF(ISBLANK($I27), \"Undefined\", IF(AV27<0.5, \"Complete\",IF(SUMPRODUCT($N$41:AV$41,$N27:AV27)<0.5, \"To start\", \"Running\")))","v":"Undefined"},0,{"$f":"MAX(AV27-AX27,0)","v":0},{"$f":"IF(ISBLANK($I27), \"Undefined\", IF(AY27<0.5, \"Complete\",IF(SUMPRODUCT($N$41:AY$41,$N27:AY27)<0.5, \"To start\", \"Running\")))","v":"Undefined"},0,{"$f":"MAX(AY27-BA27,0)","v":0},{"$f":"IF(ISBLANK($I27), \"Undefined\", IF(BB27<0.5, \"Complete\",IF(SUMPRODUCT($N$41:BB$41,$N27:BB27)<0.5, \"To start\", \"Running\")))","v":"Undefined"},0,{"$f":"MAX(BB27-BD27,0)","v":0},{"$f":"IF(ISBLANK($I27), \"Undefined\", IF(BE27<0.5, \"Complete\",IF(SUMPRODUCT($N$41:BE$41,$N27:BE27)<0.5, \"To start\", \"Running\")))","v":"Undefined"},0,{"$f":"MAX(BE27-BG27,0)","v":0},{"$f":"IF(ISBLANK($I27), \"Undefined\", IF(BH27<0.5, \"Complete\",IF(SUMPRODUCT($N$41:BH$41,$N27:BH27)<0.5, \"To start\", \"Running\")))","v":"Undefined"},0,{"$f":"MAX(BH27-BJ27,0)","v":0},{"$f":"IF(ISBLANK($I27), \"Undefined\", IF(BK27<0.5, \"Complete\",IF(SUMPRODUCT($N$41:BK$41,$N27:BK27)<0.5, \"To start\", \"Running\")))","v":"Undefined"},0,{"$f":"MAX(BK27-BM27,0)","v":0},{"$f":"IF(ISBLANK($I27), \"Undefined\", IF(BN27<0.5, \"Complete\",IF(SUMPRODUCT($N$41:BN$41,$N27:BN27)<0.5, \"To start\", \"Running\")))","v":"Undefined"},0,{"$f":"MAX(BN27-BP27,0)","v":0},{"$f":"IF(ISBLANK($I27), \"Undefined\", IF(BQ27<0.5, \"Complete\",IF(SUMPRODUCT($N$41:BQ$41,$N27:BQ27)<0.5, \"To start\", \"Running\")))","v":"Undefined"},0,{"$f":"MAX(BQ27-BS27,0)","v":0},{"$f":"IF(ISBLANK($I27), \"Undefined\", IF(BT27<0.5, \"Complete\",IF(SUMPRODUCT($N$41:BT$41,$N27:BT27)<0.5, \"To start\", \"Running\")))","v":"Undefined"},0,{"$f":"MAX(BT27-BV27,0)","v":0},{"$f":"IF(ISBLANK($I27), \"Undefined\", IF(BW27<0.5, \"Complete\",IF(SUMPRODUCT($N$41:BW$41,$N27:BW27)<0.5, \"To start\", \"Running\")))","v":"Undefined"},0,{"$f":"MAX(BW27-BY27,0)","v":0},{"$f":"IF(ISBLANK($I27), \"Undefined\", IF(BZ27<0.5, \"Complete\",IF(SUMPRODUCT($N$41:BZ$41,$N27:BZ27)<0.5, \"To start\", \"Running\")))","v":"Undefined"},0,{"$f":"MAX(BZ27-CB27,0)","v":0},{"$f":"IF(ISBLANK($I27), \"Undefined\", IF(CC27<0.5, \"Complete\",IF(SUMPRODUCT($N$41:CC$41,$N27:CC27)<0.5, \"To start\", \"Running\")))","v":"Undefined"},0,{"$f":"MAX(CC27-CE27,0)","v":0},{"$f":"IF(ISBLANK($I27), \"Undefined\", IF(CF27<0.5, \"Complete\",IF(SUMPRODUCT($N$41:CF$41,$N27:CF27)<0.5, \"To start\", \"Running\")))","v":"Undefined"},0,{"$f":"MAX(CF27-CH27,0)","v":0},{"$f":"IF(ISBLANK($I27), \"Undefined\", IF(CI27<0.5, \"Complete\",IF(SUMPRODUCT($N$41:CI$41,$N27:CI27)<0.5, \"To start\", \"Running\")))","v":"Undefined"},0,{"$f":"MAX(CI27-CK27,0)","v":0},{"$f":"IF(ISBLANK($I27), \"Undefined\", IF(CL27<0.5, \"Complete\",IF(SUMPRODUCT($N$41:CL$41,$N27:CL27)<0.5, \"To start\", \"Running\")))","v":"Undefined"},0,{"$f":"MAX(CL27-CN27,0)","v":0},{"$f":"IF(ISBLANK($I27), \"Undefined\", IF(CO27<0.5, \"Complete\",IF(SUMPRODUCT($N$41:CO$41,$N27:CO27)<0.5, \"To start\", \"Running\")))","v":"Undefined"},0,{"$f":"MAX(CO27-CQ27,0)","v":0},{"$f":"IF(ISBLANK($I27), \"Undefined\", IF(CR27<0.5, \"Complete\",IF(SUMPRODUCT($N$41:CR$41,$N27:CR27)<0.5, \"To start\", \"Running\")))","v":"Undefined"},0,{"$f":"MAX(CR27-CT27,0)","v":0},{"$f":"IF(ISBLANK($I27), \"Undefined\", IF(CU27<0.5, \"Complete\",IF(SUMPRODUCT($N$41:CU$41,$N27:CU27)<0.5, \"To start\", \"Running\")))","v":"Undefined"},0,{"$f":"MAX(CU27-CW27,0)","v":0},{"$f":"IF(ISBLANK($I27), \"Undefined\", IF(CX27<0.5, \"Complete\",IF(SUMPRODUCT($N$41:CX$41,$N27:CX27)<0.5, \"To start\", \"Running\")))","v":"Undefined"},0,{"$f":"MAX(CX27-CZ27,0)","v":0},{"$f":"IF(ISBLANK($I27), \"Undefined\", IF(DA27<0.5, \"Complete\",IF(SUMPRODUCT($N$41:DA$41,$N27:DA27)<0.5, \"To start\", \"Running\")))","v":"Undefined"},0,{"$f":"MAX(DA27-DC27,0)","v":0},{"$f":"IF(ISBLANK($I27), \"Undefined\", IF(DD27<0.5, \"Complete\",IF(SUMPRODUCT($N$41:DD$41,$N27:DD27)<0.5, \"To start\", \"Running\")))","v":"Undefined"},0,{"$f":"MAX(DD27-DF27,0)","v":0},{"$f":"IF(ISBLANK($I27), \"Undefined\", IF(DG27<0.5, \"Complete\",IF(SUMPRODUCT($N$41:DG$41,$N27:DG27)<0.5, \"To start\", \"Running\")))","v":"Undefined"},0,{"$f":"MAX(DG27-DI27,0)","v":0},{"$f":"IF(ISBLANK($I27), \"Undefined\", IF(DJ27<0.5, \"Complete\",IF(SUMPRODUCT($N$41:DJ$41,$N27:DJ27)<0.5, \"To start\", \"Running\")))","v":"Undefined"},0,{"$f":"MAX(DJ27-DL27,0)","v":0},{"$f":"IF(ISBLANK($I27), \"Undefined\", IF(DM27<0.5, \"Complete\",IF(SUMPRODUCT($N$41:DM$41,$N27:DM27)<0.5, \"To start\", \"Running\")))","v":"Undefined"},0,{"$f":"MAX(DM27-DO27,0)","v":0},{"$f":"IF(ISBLANK($I27), \"Undefined\", IF(DP27<0.5, \"Complete\",IF(SUMPRODUCT($N$41:DP$41,$N27:DP27)<0.5, \"To start\", \"Running\")))","v":"Undefined"},0,{"$f":"MAX(DP27-DR27,0)","v":0},{"$f":"IF(ISBLANK($I27), \"Undefined\", IF(DS27<0.5, \"Complete\",IF(SUMPRODUCT($N$41:DS$41,$N27:DS27)<0.5, \"To start\", \"Running\")))","v":"Undefined"},0,{"$f":"MAX(DS27-DU27,0)","v":0},{"$f":"IF(ISBLANK($I27), \"Undefined\", IF(DV27<0.5, \"Complete\",IF(SUMPRODUCT($N$41:DV$41,$N27:DV27)<0.5, \"To start\", \"Running\")))","v":"Undefined"},0,{"$f":"MAX(DV27-DX27,0)","v":0},{"$f":"IF(ISBLANK($I27), \"Undefined\", IF(DY27<0.5, \"Complete\",IF(SUMPRODUCT($N$41:DY$41,$N27:DY27)<0.5, \"To start\", \"Running\")))","v":"Undefined"},0,{"$f":"MAX(DY27-EA27,0)","v":0},{"$f":"IF(ISBLANK($I27), \"Undefined\", IF(EB27<0.5, \"Complete\",IF(SUMPRODUCT($N$41:EB$41,$N27:EB27)<0.5, \"To start\", \"Running\")))","v":"Undefined"},null,{"$f":"SUMPRODUCT($L$41:DK$41,$L27:DK27)","v":0},{"$f":"EE27/8","v":0},{"$f":"OFFSET($O27,0,(Capacity!$F$2-SprintStart)*3,1,1)","v":0},{"$f":"EG27/8","v":0},{"$f":"EE27+EG27","v":0},{"$f":"EI27/8","v":0},{"$f":"IFERROR((EI27/M27)-1,\"\")","v":""},{"$f":"EI27-M27","v":0},{"$f":"EL27/8","v":0}]
[{"$nulls":10},{"$f":"IF(SprintStart>Capacity!$F$2, \"To start\", INDEX(Burndown,ROW(K28)-ROW(K$6),MIN(Capacity!$F$2-SprintStart,29)*3+3))","v":"Undefined"},null,0,0,0,{"$f":"IF(ISBLANK($I28), \"Undefined\", IF(O28<0.5, \"Complete\",IF(SUMPRODUCT($N$41:O$41,$N28:O28)<0.5, \"To start\", \"Running\")))","v":"Undefined"},0,0,{"$f":"IF(ISBLANK($I28), \"Undefined\", IF(R28<0.5, \"Complete\",IF(SUMPRODUCT($N$41:R$41,$N28:R28)<0.5, \"To start\", \"Running\")))","v":"Undefined"},0,0,{"$f":"IF(ISBLANK($I28), \"Undefined\", IF(U28<0.5, \"Complete\",IF(SUMPRODUCT($N$41:U$41,$N28:U28)<0.5, \"To start\", \"Running\")))","v":"Undefined"},0,0,{"$f":"IF(ISBLANK($I28), \"Undefined\", IF(X28<0.5, \"Complete\",IF(SUMPRODUCT($N$41:X$41,$N28:X28)<0.5, \"To start\", \"Running\")))","v":"Undefined"},0,0,{"$f":"IF(ISBLANK($I28), \"Undefined\", IF(AA28<0.5, \"Complete\",IF(SUMPRODUCT($N$41:AA$41,$N28:AA28)<0.5, \"To start\", \"Running\")))","v":"Undefined"},0,0,{"$f":"IF(ISBLANK($I28), \"Undefined\", IF(AD28<0.5, \"Complete\",IF(SUMPRODUCT($N$41:AD$41,$N28:AD28)<0.5, \"To start\", \"Running\")))","v":"Undefined"},0,0,{"$f":"IF(ISBLANK($I28), \"Undefined\", IF(AG28<0.5, \"Complete\",IF(SUMPRODUCT($N$41:AG$41,$N28:AG28)<0.5, \"To start\", \"Running\")))","v":"Undefined"},0,0,{"$f":"IF(ISBLANK($I28), \"Undefined\", IF(AJ28<0.5, \"Complete\",IF(SUMPRODUCT($N$41:AJ$41,$N28:AJ28)<0.5, \"To start\", \"Running\")))","v":"Undefined"},0,0,{"$f":"IF(ISBLANK($I28), \"Undefined\", IF(AM28<0.5, \"Complete\",IF(SUMPRODUCT($N$41:AM$41,$N28:AM28)<0.5, \"To start\", \"Running\")))","v":"Undefined"},0,0,{"$f":"IF(ISBLANK($I28), \"Undefined\", IF(AP28<0.5, \"Complete\",IF(SUMPRODUCT($N$41:AP$41,$N28:AP28)<0.5, \"To start\", \"Running\")))","v":"Undefined"},0,0,{"$f":"IF(ISBLANK($I28), \"Undefined\", IF(AS28<0.5, \"Complete\",IF(SUMPRODUCT($N$41:AS$41,$N28:AS28)<0.5, \"To start\", \"Running\")))","v":"Undefined"},0,0,{"$f":"IF(ISBLANK($I28), \"Undefined\", IF(AV28<0.5, \"Complete\",IF(SUMPRODUCT($N$41:AV$41,$N28:AV28)<0.5, \"To start\", \"Running\")))","v":"Undefined"},0,0,{"$f":"IF(ISBLANK($I28), \"Undefined\", IF(AY28<0.5, \"Complete\",IF(SUMPRODUCT($N$41:AY$41,$N28:AY28)<0.5, \"To start\", \"Running\")))","v":"Undefined"},0,0,{"$f":"IF(ISBLANK($I28), \"Undefined\", IF(BB28<0.5, \"Complete\",IF(SUMPRODUCT($N$41:BB$41,$N28:BB28)<0.5, \"To start\", \"Running\")))","v":"Undefined"},0,0,{"$f":"IF(ISBLANK($I28), \"Undefined\", IF(BE28<0.5, \"Complete\",IF(SUMPRODUCT($N$41:BE$41,$N28:BE28)<0.5, \"To start\", \"Running\")))","v":"Undefined"},0,0,{"$f":"IF(ISBLANK($I28), \"Undefined\", IF(BH28<0.5, \"Complete\",IF(SUMPRODUCT($N$41:BH$41,$N28:BH28)<0.5, \"To start\", \"Running\")))","v":"Undefined"},0,0,{"$f":"IF(ISBLANK($I28), \"Undefined\", IF(BK28<0.5, \"Complete\",IF(SUMPRODUCT($N$41:BK$41,$N28:BK28)<0.5, \"To start\", \"Running\")))","v":"Undefined"},0,0,{"$f":"IF(ISBLANK($I28), \"Undefined\", IF(BN28<0.5, \"Complete\",IF(SUMPRODUCT($N$41:BN$41,$N28:BN28)<0.5, \"To start\", \"Running\")))","v":"Undefined"},0,0,{"$f":"IF(ISBLANK($I28), \"Undefined\", IF(BQ28<0.5, \"Complete\",IF(SUMPRODUCT($N$41:BQ$41,$N28:BQ28)<0.5, \"To start\", \"Running\")))","v":"Undefined"},0,0,{"$f":"IF(ISBLANK($I28), \"Undefined\", IF(BT28<0.5, \"Complete\",IF(SUMPRODUCT($N$41:BT$41,$N28:BT28)<0.5, \"To start\", \"Running\")))","v":"Undefined"},0,0,{"$f":"IF(ISBLANK($I28), \"Undefined\", IF(BW28<0.5, \"Complete\",IF(SUMPRODUCT($N$41:BW$41,$N28:BW28)<0.5, \"To start\", \"Running\")))","v":"Undefined"},0,0,{"$f":"IF(ISBLANK($I28), \"Undefined\", IF(BZ28<0.5, \"Complete\",IF(SUMPRODUCT($N$41:BZ$41,$N28:BZ28)<0.5, \"To start\", \"Running\")))","v":"Undefined"},0,0,{"$f":"IF(ISBLANK($I28), \"Undefined\", IF(CC28<0.5, \"Complete\",IF(SUMPRODUCT($N$41:CC$41,$N28:CC28)<0.5, \"To start\", \"Running\")))","v":"Undefined"},0,0,{"$f":"IF(ISBLANK($I28), \"Undefined\", IF(CF28<0.5, \"Complete\",IF(SUMPRODUCT($N$41:CF$41,$N28:CF28)<0.5, \"To start\", \"Running\")))","v":"Undefined"},0,0,{"$f":"IF(ISBLANK($I28), \"Undefined\", IF(CI28<0.5, \"Complete\",IF(SUMPRODUCT($N$41:CI$41,$N28:CI28)<0.5, \"To start\", \"Running\")))","v":"Undefined"},0,0,{"$f":"IF(ISBLANK($I28), \"Undefined\", IF(CL28<0.5, \"Complete\",IF(SUMPRODUCT($N$41:CL$41,$N28:CL28)<0.5, \"To start\", \"Running\")))","v":"Undefined"},0,0,{"$f":"IF(ISBLANK($I28), \"Undefined\", IF(CO28<0.5, \"Complete\",IF(SUMPRODUCT($N$41:CO$41,$N28:CO28)<0.5, \"To start\", \"Running\")))","v":"Undefined"},0,0,{"$f":"IF(ISBLANK($I28), \"Undefined\", IF(CR28<0.5, \"Complete\",IF(SUMPRODUCT($N$41:CR$41,$N28:CR28)<0.5, \"To start\", \"Running\")))","v":"Undefined"},0,0,{"$f":"IF(ISBLANK($I28), \"Undefined\", IF(CU28<0.5, \"Complete\",IF(SUMPRODUCT($N$41:CU$41,$N28:CU28)<0.5, \"To start\", \"Running\")))","v":"Undefined"},0,0,{"$f":"IF(ISBLANK($I28), \"Undefined\", IF(CX28<0.5, \"Complete\",IF(SUMPRODUCT($N$41:CX$41,$N28:CX28)<0.5, \"To start\", \"Running\")))","v":"Undefined"},0,0,{"$f":"IF(ISBLANK($I28), \"Undefined\", IF(DA28<0.5, \"Complete\",IF(SUMPRODUCT($N$41:DA$41,$N28:DA28)<0.5, \"To start\", \"Running\")))","v":"Undefined"},0,0,{"$f":"IF(ISBLANK($I28), \"Undefined\", IF(DD28<0.5, \"Complete\",IF(SUMPRODUCT($N$41:DD$41,$N28:DD28)<0.5, \"To start\", \"Running\")))","v":"Undefined"},0,0,{"$f":"IF(ISBLANK($I28), \"Undefined\", IF(DG28<0.5, \"Complete\",IF(SUMPRODUCT($N$41:DG$41,$N28:DG28)<0.5, \"To start\", \"Running\")))","v":"Undefined"},0,0,{"$f":"IF(ISBLANK($I28), \"Undefined\", IF(DJ28<0.5, \"Complete\",IF(SUMPRODUCT($N$41:DJ$41,$N28:DJ28)<0.5, \"To start\", \"Running\")))","v":"Undefined"},0,0,{"$f":"IF(ISBLANK($I28), \"Undefined\", IF(DM28<0.5, \"Complete\",IF(SUMPRODUCT($N$41:DM$41,$N28:DM28)<0.5, \"To start\", \"Running\")))","v":"Undefined"},0,0,{"$f":"IF(ISBLANK($I28), \"Undefined\", IF(DP28<0.5, \"Complete\",IF(SUMPRODUCT($N$41:DP$41,$N28:DP28)<0.5, \"To start\", \"Running\")))","v":"Undefined"},0,0,{"$f":"IF(ISBLANK($I28), \"Undefined\", IF(DS28<0.5, \"Complete\",IF(SUMPRODUCT($N$41:DS$41,$N28:DS28)<0.5, \"To start\", \"Running\")))","v":"Undefined"},0,0,{"$f":"IF(ISBLANK($I28), \"Undefined\", IF(DV28<0.5, \"Complete\",IF(SUMPRODUCT($N$41:DV$41,$N28:DV28)<0.5, \"To start\", \"Running\")))","v":"Undefined"},0,0,{"$f":"IF(ISBLANK($I28), \"Undefined\", IF(DY28<0.5, \"Complete\",IF(SUMPRODUCT($N$41:DY$41,$N28:DY28)<0.5, \"To start\", \"Running\")))","v":"Undefined"},0,0,{"$f":"IF(ISBLANK($I28), \"Undefined\", IF(EB28<0.5, \"Complete\",IF(SUMPRODUCT($N$41:EB$41,$N28:EB28)<0.5, \"To start\", \"Running\")))","v":"Undefined"},null,{"$f":"SUMPRODUCT($L$41:DK$41,$L28:DK28)","v":0},0,{"$f":"OFFSET($O28,0,(Capacity!$F$2-SprintStart)*3,1,1)","v":0},0,0,0,"",0,0]
[{"$nulls":10},{"$f":"IF(SprintStart>Capacity!$F$2, \"To start\", INDEX(Burndown,ROW(K29)-ROW(K$6),MIN(Capacity!$F$2-SprintStart,29)*3+3))","v":"Undefined"},null,0,0,0,{"$f":"IF(ISBLANK($I29), \"Undefined\", IF(O29<0.5, \"Complete\",IF(SUMPRODUCT($N$41:O$41,$N29:O29)<0.5, \"To start\", \"Running\")))","v":"Undefined"},0,0,{"$f":"IF(ISBLANK($I29), \"Undefined\", IF(R29<0.5, \"Complete\",IF(SUMPRODUCT($N$41:R$41,$N29:R29)<0.5, \"To start\", \"Running\")))","v":"Undefined"},0,0,{"$f":"IF(ISBLANK($I29), \"Undefined\", IF(U29<0.5, \"Complete\",IF(SUMPRODUCT($N$41:U$41,$N29:U29)<0.5, \"To start\", \"Running\")))","v":"Undefined"},0,0,{"$f":"IF(ISBLANK($I29), \"Undefined\", IF(X29<0.5, \"Complete\",IF(SUMPRODUCT($N$41:X$41,$N29:X29)<0.5, \"To start\", \"Running\")))","v":"Undefined"},0,0,{"$f":"IF(ISBLANK($I29), \"Undefined\", IF(AA29<0.5, \"Complete\",IF(SUMPRODUCT($N$41:AA$41,$N29:AA29)<0.5, \"To start\", \"Running\")))","v":"Undefined"},0,0,{"$f":"IF(ISBLANK($I29), \"Undefined\", IF(AD29<0.5, \"Complete\",IF(SUMPRODUCT($N$41:AD$41,$N29:AD29)<0.5, \"To start\", \"Running\")))","v":"Undefined"},0,0,{"$f":"IF(ISBLANK($I29), \"Undefined\", IF(AG29<0.5, \"Complete\",IF(SUMPRODUCT($N$41:AG$41,$N29:AG29)<0.5, \"To start\", \"Running\")))","v":"Undefined"},0,0,{"$f":"IF(ISBLANK($I29), \"Undefined\", IF(AJ29<0.5, \"Complete\",IF(SUMPRODUCT($N$41:AJ$41,$N29:AJ29)<0.5, \"To start\", \"Running\")))","v":"Undefined"},0,0,{"$f":"IF(ISBLANK($I29), \"Undefined\", IF(AM29<0.5, \"Complete\",IF(SUMPRODUCT($N$41:AM$41,$N29:AM29)<0.5, \"To start\", \"Running\")))","v":"Undefined"},0,0,{"$f":"IF(ISBLANK($I29), \"Undefined\", IF(AP29<0.5, \"Complete\",IF(SUMPRODUCT($N$41:AP$41,$N29:AP29)<0.5, \"To start\", \"Running\")))","v":"Undefined"},0,0,{"$f":"IF(ISBLANK($I29), \"Undefined\", IF(AS29<0.5, \"Complete\",IF(SUMPRODUCT($N$41:AS$41,$N29:AS29)<0.5, \"To start\", \"Running\")))","v":"Undefined"},0,0,{"$f":"IF(ISBLANK($I29), \"Undefined\", IF(AV29<0.5, \"Complete\",IF(SUMPRODUCT($N$41:AV$41,$N29:AV29)<0.5, \"To start\", \"Running\")))","v":"Undefined"},0,0,{"$f":"IF(ISBLANK($I29), \"Undefined\", IF(AY29<0.5, \"Complete\",IF(SUMPRODUCT($N$41:AY$41,$N29:AY29)<0.5, \"To start\", \"Running\")))","v":"Undefined"},0,0,{"$f":"IF(ISBLANK($I29), \"Undefined\", IF(BB29<0.5, \"Complete\",IF(SUMPRODUCT($N$41:BB$41,$N29:BB29)<0.5, \"To start\", \"Running\")))","v":"Undefined"},0,0,{"$f":"IF(ISBLANK($I29), \"Undefined\", IF(BE29<0.5, \"Complete\",IF(SUMPRODUCT($N$41:BE$41,$N29:BE29)<0.5, \"To start\", \"Running\")))","v":"Undefined"},0,0,{"$f":"IF(ISBLANK($I29), \"Undefined\", IF(BH29<0.5, \"Complete\",IF(SUMPRODUCT($N$41:BH$41,$N29:BH29)<0.5, \"To start\", \"Running\")))","v":"Undefined"},0,0,{"$f":"IF(ISBLANK($I29), \"Undefined\", IF(BK29<0.5, \"Complete\",IF(SUMPRODUCT($N$41:BK$41,$N29:BK29)<0.5, \"To start\", \"Running\")))","v":"Undefined"},0,0,{"$f":"IF(ISBLANK($I29), \"Undefined\", IF(BN29<0.5, \"Complete\",IF(SUMPRODUCT($N$41:BN$41,$N29:BN29)<0.5, \"To start\", \"Running\")))","v":"Undefined"},0,0,{"$f":"IF(ISBLANK($I29), \"Undefined\", IF(BQ29<0.5, \"Complete\",IF(SUMPRODUCT($N$41:BQ$41,$N29:BQ29)<0.5, \"To start\", \"Running\")))","v":"Undefined"},0,0,{"$f":"IF(ISBLANK($I29), \"Undefined\", IF(BT29<0.5, \"Complete\",IF(SUMPRODUCT($N$41:BT$41,$N29:BT29)<0.5, \"To start\", \"Running\")))","v":"Undefined"},0,0,{"$f":"IF(ISBLANK($I29), \"Undefined\", IF(BW29<0.5, \"Complete\",IF(SUMPRODUCT($N$41:BW$41,$N29:BW29)<0.5, \"To start\", \"Running\")))","v":"Undefined"},0,0,{"$f":"IF(ISBLANK($I29), \"Undefined\", IF(BZ29<0.5, \"Complete\",IF(SUMPRODUCT($N$41:BZ$41,$N29:BZ29)<0.5, \"To start\", \"Running\")))","v":"Undefined"},0,0,{"$f":"IF(ISBLANK($I29), \"Undefined\", IF(CC29<0.5, \"Complete\",IF(SUMPRODUCT($N$41:CC$41,$N29:CC29)<0.5, \"To start\", \"Running\")))","v":"Undefined"},0,0,{"$f":"IF(ISBLANK($I29), \"Undefined\", IF(CF29<0.5, \"Complete\",IF(SUMPRODUCT($N$41:CF$41,$N29:CF29)<0.5, \"To start\", \"Running\")))","v":"Undefined"},0,0,{"$f":"IF(ISBLANK($I29), \"Undefined\", IF(CI29<0.5, \"Complete\",IF(SUMPRODUCT($N$41:CI$41,$N29:CI29)<0.5, \"To start\", \"Running\")))","v":"Undefined"},0,0,{"$f":"IF(ISBLANK($I29), \"Undefined\", IF(CL29<0.5, \"Complete\",IF(SUMPRODUCT($N$41:CL$41,$N29:CL29)<0.5, \"To start\", \"Running\")))","v":"Undefined"},0,0,{"$f":"IF(ISBLANK($I29), \"Undefined\", IF(CO29<0.5, \"Complete\",IF(SUMPRODUCT($N$41:CO$41,$N29:CO29)<0.5, \"To start\", \"Running\")))","v":"Undefined"},0,0,{"$f":"IF(ISBLANK($I29), \"Undefined\", IF(CR29<0.5, \"Complete\",IF(SUMPRODUCT($N$41:CR$41,$N29:CR29)<0.5, \"To start\", \"Running\")))","v":"Undefined"},0,0,{"$f":"IF(ISBLANK($I29), \"Undefined\", IF(CU29<0.5, \"Complete\",IF(SUMPRODUCT($N$41:CU$41,$N29:CU29)<0.5, \"To start\", \"Running\")))","v":"Undefined"},0,0,{"$f":"IF(ISBLANK($I29), \"Undefined\", IF(CX29<0.5, \"Complete\",IF(SUMPRODUCT($N$41:CX$41,$N29:CX29)<0.5, \"To start\", \"Running\")))","v":"Undefined"},0,0,{"$f":"IF(ISBLANK($I29), \"Undefined\", IF(DA29<0.5, \"Complete\",IF(SUMPRODUCT($N$41:DA$41,$N29:DA29)<0.5, \"To start\", \"Running\")))","v":"Undefined"},0,0,{"$f":"IF(ISBLANK($I29), \"Undefined\", IF(DD29<0.5, \"Complete\",IF(SUMPRODUCT($N$41:DD$41,$N29:DD29)<0.5, \"To start\", \"Running\")))","v":"Undefined"},0,0,{"$f":"IF(ISBLANK($I29), \"Undefined\", IF(DG29<0.5, \"Complete\",IF(SUMPRODUCT($N$41:DG$41,$N29:DG29)<0.5, \"To start\", \"Running\")))","v":"Undefined"},0,0,{"$f":"IF(ISBLANK($I29), \"Undefined\", IF(DJ29<0.5, \"Complete\",IF(SUMPRODUCT($N$41:DJ$41,$N29:DJ29)<0.5, \"To start\", \"Running\")))","v":"Undefined"},0,0,{"$f":"IF(ISBLANK($I29), \"Undefined\", IF(DM29<0.5, \"Complete\",IF(SUMPRODUCT($N$41:DM$41,$N29:DM29)<0.5, \"To start\", \"Running\")))","v":"Undefined"},0,0,{"$f":"IF(ISBLANK($I29), \"Undefined\", IF(DP29<0.5, \"Complete\",IF(SUMPRODUCT($N$41:DP$41,$N29:DP29)<0.5, \"To start\", \"Running\")))","v":"Undefined"},0,0,{"$f":"IF(ISBLANK($I29), \"Undefined\", IF(DS29<0.5, \"Complete\",IF(SUMPRODUCT($N$41:DS$41,$N29:DS29)<0.5, \"To start\", \"Running\")))","v":"Undefined"},0,0,{"$f":"IF(ISBLANK($I29), \"Undefined\", IF(DV29<0.5, \"Complete\",IF(SUMPRODUCT($N$41:DV$41,$N29:DV29)<0.5, \"To start\", \"Running\")))","v":"Undefined"},0,0,{"$f":"IF(ISBLANK($I29), \"Undefined\", IF(DY29<0.5, \"Complete\",IF(SUMPRODUCT($N$41:DY$41,$N29:DY29)<0.5, \"To start\", \"Running\")))","v":"Undefined"},0,0,{"$f":"IF(ISBLANK($I29), \"Undefined\", IF(EB29<0.5, \"Complete\",IF(SUMPRODUCT($N$41:EB$41,$N29:EB29)<0.5, \"To start\", \"Running\")))","v":"Undefined"},null,{"$f":"SUMPRODUCT($L$41:DK$41,$L29:DK29)","v":0},0,{"$f":"OFFSET($O29,0,(Capacity!$F$2-SprintStart)*3,1,1)","v":0},0,0,0,"",0,0]
[{"$nulls":10},{"$f":"IF(SprintStart>Capacity!$F$2, \"To start\", INDEX(Burndown,ROW(K30)-ROW(K$6),MIN(Capacity!$F$2-SprintStart,29)*3+3))","v":"Undefined"},null,0,0,0,{"$f":"IF(ISBLANK($I30), \"Undefined\", IF(O30<0.5, \"Complete\",IF(SUMPRODUCT($N$41:O$41,$N30:O30)<0.5, \"To start\", \"Running\")))","v":"Undefined"},0,0,{"$f":"IF(ISBLANK($I30), \"Undefined\", IF(R30<0.5, \"Complete\",IF(SUMPRODUCT($N$41:R$41,$N30:R30)<0.5, \"To start\", \"Running\")))","v":"Undefined"},0,0,{"$f":"IF(ISBLANK($I30), \"Undefined\", IF(U30<0.5, \"Complete\",IF(SUMPRODUCT($N$41:U$41,$N30:U30)<0.5, \"To start\", \"Running\")))","v":"Undefined"},0,0,{"$f":"IF(ISBLANK($I30), \"Undefined\", IF(X30<0.5, \"Complete\",IF(SUMPRODUCT($N$41:X$41,$N30:X30)<0.5, \"To start\", \"Running\")))","v":"Undefined"},0,0,{"$f":"IF(ISBLANK($I30), \"Undefined\", IF(AA30<0.5, \"Complete\",IF(SUMPRODUCT($N$41:AA$41,$N30:AA30)<0.5, \"To start\", \"Running\")))","v":"Undefined"},0,0,{"$f":"IF(ISBLANK($I30), \"Undefined\", IF(AD30<0.5, \"Complete\",IF(SUMPRODUCT($N$41:AD$41,$N30:AD30)<0.5, \"To start\", \"Running\")))","v":"Undefined"},0,0,{"$f":"IF(ISBLANK($I30), \"Undefined\", IF(AG30<0.5, \"Complete\",IF(SUMPRODUCT($N$41:AG$41,$N30:AG30)<0.5, \"To start\", \"Running\")))","v":"Undefined"},0,0,{"$f":"IF(ISBLANK($I30), \"Undefined\", IF(AJ30<0.5, \"Complete\",IF(SUMPRODUCT($N$41:AJ$41,$N30:AJ30)<0.5, \"To start\", \"Running\")))","v":"Undefined"},0,0,{"$f":"IF(ISBLANK($I30), \"Undefined\", IF(AM30<0.5, \"Complete\",IF(SUMPRODUCT($N$41:AM$41,$N30:AM30)<0.5, \"To start\", \"Running\")))","v":"Undefined"},0,0,{"$f":"IF(ISBLANK($I30), \"Undefined\", IF(AP30<0.5, \"Complete\",IF(SUMPRODUCT($N$41:AP$41,$N30:AP30)<0.5, \"To start\", \"Running\")))","v":"Undefined"},0,0,{"$f":"IF(ISBLANK($I30), \"Undefined\", IF(AS30<0.5, \"Complete\",IF(SUMPRODUCT($N$41:AS$41,$N30:AS30)<0.5, \"To start\", \"Running\")))","v":"Undefined"},0,0,{"$f":"IF(ISBLANK($I30), \"Undefined\", IF(AV30<0.5, \"Complete\",IF(SUMPRODUCT($N$41:AV$41,$N30:AV30)<0.5, \"To start\", \"Running\")))","v":"Undefined"},0,0,{"$f":"IF(ISBLANK($I30), \"Undefined\", IF(AY30<0.5, \"Complete\",IF(SUMPRODUCT($N$41:AY$41,$N30:AY30)<0.5, \"To start\", \"Running\")))","v":"Undefined"},0,0,{"$f":"IF(ISBLANK($I30), \"Undefined\", IF(BB30<0.5, \"Complete\",IF(SUMPRODUCT($N$41:BB$41,$N30:BB30)<0.5, \"To start\", \"Running\")))","v":"Undefined"},0,0,{"$f":"IF(ISBLANK($I30), \"Undefined\", IF(BE30<0.5, \"Complete\",IF(SUMPRODUCT($N$41:BE$41,$N30:BE30)<0.5, \"To start\", \"Running\")))","v":"Undefined"},0,0,{"$f":"IF(ISBLANK($I30), \"Undefined\", IF(BH30<0.5, \"Complete\",IF(SUMPRODUCT($N$41:BH$41,$N30:BH30)<0.5, \"To start\", \"Running\")))","v":"Undefined"},0,0,{"$f":"IF(ISBLANK($I30), \"Undefined\", IF(BK30<0.5, \"Complete\",IF(SUMPRODUCT($N$41:BK$41,$N30:BK30)<0.5, \"To start\", \"Running\")))","v":"Undefined"},0,0,{"$f":"IF(ISBLANK($I30), \"Undefined\", IF(BN30<0.5, \"Complete\",IF(SUMPRODUCT($N$41:BN$41,$N30:BN30)<0.5, \"To start\", \"Running\")))","v":"Undefined"},0,0,{"$f":"IF(ISBLANK($I30), \"Undefined\", IF(BQ30<0.5, \"Complete\",IF(SUMPRODUCT($N$41:BQ$41,$N30:BQ30)<0.5, \"To start\", \"Running\")))","v":"Undefined"},0,0,{"$f":"IF(ISBLANK($I30), \"Undefined\", IF(BT30<0.5, \"Complete\",IF(SUMPRODUCT($N$41:BT$41,$N30:BT30)<0.5, \"To start\", \"Running\")))","v":"Undefined"},0,0,{"$f":"IF(ISBLANK($I30), \"Undefined\", IF(BW30<0.5, \"Complete\",IF(SUMPRODUCT($N$41:BW$41,$N30:BW30)<0.5, \"To start\", \"Running\")))","v":"Undefined"},0,0,{"$f":"IF(ISBLANK($I30), \"Undefined\", IF(BZ30<0.5, \"Complete\",IF(SUMPRODUCT($N$41:BZ$41,$N30:BZ30)<0.5, \"To start\", \"Running\")))","v":"Undefined"},0,0,{"$f":"IF(ISBLANK($I30), \"Undefined\", IF(CC30<0.5, \"Complete\",IF(SUMPRODUCT($N$41:CC$41,$N30:CC30)<0.5, \"To start\", \"Running\")))","v":"Undefined"},0,0,{"$f":"IF(ISBLANK($I30), \"Undefined\", IF(CF30<0.5, \"Complete\",IF(SUMPRODUCT($N$41:CF$41,$N30:CF30)<0.5, \"To start\", \"Running\")))","v":"Undefined"},0,0,{"$f":"IF(ISBLANK($I30), \"Undefined\", IF(CI30<0.5, \"Complete\",IF(SUMPRODUCT($N$41:CI$41,$N30:CI30)<0.5, \"To start\", \"Running\")))","v":"Undefined"},0,0,{"$f":"IF(ISBLANK($I30), \"Undefined\", IF(CL30<0.5, \"Complete\",IF(SUMPRODUCT($N$41:CL$41,$N30:CL30)<0.5, \"To start\", \"Running\")))","v":"Undefined"},0,0,{"$f":"IF(ISBLANK($I30), \"Undefined\", IF(CO30<0.5, \"Complete\",IF(SUMPRODUCT($N$41:CO$41,$N30:CO30)<0.5, \"To start\", \"Running\")))","v":"Undefined"},0,0,{"$f":"IF(ISBLANK($I30), \"Undefined\", IF(CR30<0.5, \"Complete\",IF(SUMPRODUCT($N$41:CR$41,$N30:CR30)<0.5, \"To start\", \"Running\")))","v":"Undefined"},0,0,{"$f":"IF(ISBLANK($I30), \"Undefined\", IF(CU30<0.5, \"Complete\",IF(SUMPRODUCT($N$41:CU$41,$N30:CU30)<0.5, \"To start\", \"Running\")))","v":"Undefined"},0,0,{"$f":"IF(ISBLANK($I30), \"Undefined\", IF(CX30<0.5, \"Complete\",IF(SUMPRODUCT($N$41:CX$41,$N30:CX30)<0.5, \"To start\", \"Running\")))","v":"Undefined"},0,0,{"$f":"IF(ISBLANK($I30), \"Undefined\", IF(DA30<0.5, \"Complete\",IF(SUMPRODUCT($N$41:DA$41,$N30:DA30)<0.5, \"To start\", \"Running\")))","v":"Undefined"},0,0,{"$f":"IF(ISBLANK($I30), \"Undefined\", IF(DD30<0.5, \"Complete\",IF(SUMPRODUCT($N$41:DD$41,$N30:DD30)<0.5, \"To start\", \"Running\")))","v":"Undefined"},0,0,{"$f":"IF(ISBLANK($I30), \"Undefined\", IF(DG30<0.5, \"Complete\",IF(SUMPRODUCT($N$41:DG$41,$N30:DG30)<0.5, \"To start\", \"Running\")))","v":"Undefined"},0,0,{"$f":"IF(ISBLANK($I30), \"Undefined\", IF(DJ30<0.5, \"Complete\",IF(SUMPRODUCT($N$41:DJ$41,$N30:DJ30)<0.5, \"To start\", \"Running\")))","v":"Undefined"},0,0,{"$f":"IF(ISBLANK($I30), \"Undefined\", IF(DM30<0.5, \"Complete\",IF(SUMPRODUCT($N$41:DM$41,$N30:DM30)<0.5, \"To start\", \"Running\")))","v":"Undefined"},0,0,{"$f":"IF(ISBLANK($I30), \"Undefined\", IF(DP30<0.5, \"Complete\",IF(SUMPRODUCT($N$41:DP$41,$N30:DP30)<0.5, \"To start\", \"Running\")))","v":"Undefined"},0,0,{"$f":"IF(ISBLANK($I30), \"Undefined\", IF(DS30<0.5, \"Complete\",IF(SUMPRODUCT($N$41:DS$41,$N30:DS30)<0.5, \"To start\", \"Running\")))","v":"Undefined"},0,0,{"$f":"IF(ISBLANK($I30), \"Undefined\", IF(DV30<0.5, \"Complete\",IF(SUMPRODUCT($N$41:DV$41,$N30:DV30)<0.5, \"To start\", \"Running\")))","v":"Undefined"},0,0,{"$f":"IF(ISBLANK($I30), \"Undefined\", IF(DY30<0.5, \"Complete\",IF(SUMPRODUCT($N$41:DY$41,$N30:DY30)<0.5, \"To start\", \"Running\")))","v":"Undefined"},0,0,{"$f":"IF(ISBLANK($I30), \"Undefined\", IF(EB30<0.5, \"Complete\",IF(SUMPRODUCT($N$41:EB$41,$N30:EB30)<0.5, \"To start\", \"Running\")))","v":"Undefined"},null,{"$f":"SUMPRODUCT($L$41:DK$41,$L30:DK30)","v":0},0,{"$f":"OFFSET($O30,0,(Capacity!$F$2-SprintStart)*3,1,1)","v":0},0,0,0,"",0,0]
[{"$nulls":10},{"$f":"IF(SprintStart>Capacity!$F$2, \"To start\", INDEX(Burndown,ROW(K31)-ROW(K$6),MIN(Capacity!$F$2-SprintStart,29)*3+3))","v":"Undefined"},null,0,0,0,{"$f":"IF(ISBLANK($I31), \"Undefined\", IF(O31<0.5, \"Complete\",IF(SUMPRODUCT($N$41:O$41,$N31:O31)<0.5, \"To start\", \"Running\")))","v":"Undefined"},0,0,{"$f":"IF(ISBLANK($I31), \"Undefined\", IF(R31<0.5, \"Complete\",IF(SUMPRODUCT($N$41:R$41,$N31:R31)<0.5, \"To start\", \"Running\")))","v":"Undefined"},0,0,{"$f":"IF(ISBLANK($I31), \"Undefined\", IF(U31<0.5, \"Complete\",IF(SUMPRODUCT($N$41:U$41,$N31:U31)<0.5, \"To start\", \"Running\")))","v":"Undefined"},0,0,{"$f":"IF(ISBLANK($I31), \"Undefined\", IF(X31<0.5, \"Complete\",IF(SUMPRODUCT($N$41:X$41,$N31:X31)<0.5, \"To start\", \"Running\")))","v":"Undefined"},0,0,{"$f":"IF(ISBLANK($I31), \"Undefined\", IF(AA31<0.5, \"Complete\",IF(SUMPRODUCT($N$41:AA$41,$N31:AA31)<0.5, \"To start\", \"Running\")))","v":"Undefined"},0,0,{"$f":"IF(ISBLANK($I31), \"Undefined\", IF(AD31<0.5, \"Complete\",IF(SUMPRODUCT($N$41:AD$41,$N31:AD31)<0.5, \"To start\", \"Running\")))","v":"Undefined"},0,0,{"$f":"IF(ISBLANK($I31), \"Undefined\", IF(AG31<0.5, \"Complete\",IF(SUMPRODUCT($N$41:AG$41,$N31:AG31)<0.5, \"To start\", \"Running\")))","v":"Undefined"},0,0,{"$f":"IF(ISBLANK($I31), \"Undefined\", IF(AJ31<0.5, \"Complete\",IF(SUMPRODUCT($N$41:AJ$41,$N31:AJ31)<0.5, \"To start\", \"Running\")))","v":"Undefined"},0,0,{"$f":"IF(ISBLANK($I31), \"Undefined\", IF(AM31<0.5, \"Complete\",IF(SUMPRODUCT($N$41:AM$41,$N31:AM31)<0.5, \"To start\", \"Running\")))","v":"Undefined"},0,0,{"$f":"IF(ISBLANK($I31), \"Undefined\", IF(AP31<0.5, \"Complete\",IF(SUMPRODUCT($N$41:AP$41,$N31:AP31)<0.5, \"To start\", \"Running\")))","v":"Undefined"},0,0,{"$f":"IF(ISBLANK($I31), \"Undefined\", IF(AS31<0.5, \"Complete\",IF(SUMPRODUCT($N$41:AS$41,$N31:AS31)<0.5, \"To start\", \"Running\")))","v":"Undefined"},0,0,{"$f":"IF(ISBLANK($I31), \"Undefined\", IF(AV31<0.5, \"Complete\",IF(SUMPRODUCT($N$41:AV$41,$N31:AV31)<0.5, \"To start\", \"Running\")))","v":"Undefined"},0,0,{"$f":"IF(ISBLANK($I31), \"Undefined\", IF(AY31<0.5, \"Complete\",IF(SUMPRODUCT($N$41:AY$41,$N31:AY31)<0.5, \"To start\", \"Running\")))","v":"Undefined"},0,0,{"$f":"IF(ISBLANK($I31), \"Undefined\", IF(BB31<0.5, \"Complete\",IF(SUMPRODUCT($N$41:BB$41,$N31:BB31)<0.5, \"To start\", \"Running\")))","v":"Undefined"},0,0,{"$f":"IF(ISBLANK($I31), \"Undefined\", IF(BE31<0.5, \"Complete\",IF(SUMPRODUCT($N$41:BE$41,$N31:BE31)<0.5, \"To start\", \"Running\")))","v":"Undefined"},0,0,{"$f":"IF(ISBLANK($I31), \"Undefined\", IF(BH31<0.5, \"Complete\",IF(SUMPRODUCT($N$41:BH$41,$N31:BH31)<0.5, \"To start\", \"Running\")))","v":"Undefined"},0,0,{"$f":"IF(ISBLANK($I31), \"Undefined\", IF(BK31<0.5, \"Complete\",IF(SUMPRODUCT($N$41:BK$41,$N31:BK31)<0.5, \"To start\", \"Running\")))","v":"Undefined"},0,0,{"$f":"IF(ISBLANK($I31), \"Undefined\", IF(BN31<0.5, \"Complete\",IF(SUMPRODUCT($N$41:BN$41,$N31:BN31)<0.5, \"To start\", \"Running\")))","v":"Undefined"},0,0,{"$f":"IF(ISBLANK($I31), \"Undefined\", IF(BQ31<0.5, \"Complete\",IF(SUMPRODUCT($N$41:BQ$41,$N31:BQ31)<0.5, \"To start\", \"Running\")))","v":"Undefined"},0,0,{"$f":"IF(ISBLANK($I31), \"Undefined\", IF(BT31<0.5, \"Complete\",IF(SUMPRODUCT($N$41:BT$41,$N31:BT31)<0.5, \"To start\", \"Running\")))","v":"Undefined"},0,0,{"$f":"IF(ISBLANK($I31), \"Undefined\", IF(BW31<0.5, \"Complete\",IF(SUMPRODUCT($N$41:BW$41,$N31:BW31)<0.5, \"To start\", \"Running\")))","v":"Undefined"},0,0,{"$f":"IF(ISBLANK($I31), \"Undefined\", IF(BZ31<0.5, \"Complete\",IF(SUMPRODUCT($N$41:BZ$41,$N31:BZ31)<0.5, \"To start\", \"Running\")))","v":"Undefined"},0,0,{"$f":"IF(ISBLANK($I31), \"Undefined\", IF(CC31<0.5, \"Complete\",IF(SUMPRODUCT($N$41:CC$41,$N31:CC31)<0.5, \"To start\", \"Running\")))","v":"Undefined"},0,0,{"$f":"IF(ISBLANK($I31), \"Undefined\", IF(CF31<0.5, \"Complete\",IF(SUMPRODUCT($N$41:CF$41,$N31:CF31)<0.5, \"To start\", \"Running\")))","v":"Undefined"},0,0,{"$f":"IF(ISBLANK($I31), \"Undefined\", IF(CI31<0.5, \"Complete\",IF(SUMPRODUCT($N$41:CI$41,$N31:CI31)<0.5, \"To start\", \"Running\")))","v":"Undefined"},0,0,{"$f":"IF(ISBLANK($I31), \"Undefined\", IF(CL31<0.5, \"Complete\",IF(SUMPRODUCT($N$41:CL$41,$N31:CL31)<0.5, \"To start\", \"Running\")))","v":"Undefined"},0,0,{"$f":"IF(ISBLANK($I31), \"Undefined\", IF(CO31<0.5, \"Complete\",IF(SUMPRODUCT($N$41:CO$41,$N31:CO31)<0.5, \"To start\", \"Running\")))","v":"Undefined"},0,0,{"$f":"IF(ISBLANK($I31), \"Undefined\", IF(CR31<0.5, \"Complete\",IF(SUMPRODUCT($N$41:CR$41,$N31:CR31)<0.5, \"To start\", \"Running\")))","v":"Undefined"},0,0,{"$f":"IF(ISBLANK($I31), \"Undefined\", IF(CU31<0.5, \"Complete\",IF(SUMPRODUCT($N$41:CU$41,$N31:CU31)<0.5, \"To start\", \"Running\")))","v":"Undefined"},0,0,{"$f":"IF(ISBLANK($I31), \"Undefined\", IF(CX31<0.5, \"Complete\",IF(SUMPRODUCT($N$41:CX$41,$N31:CX31)<0.5, \"To start\", \"Running\")))","v":"Undefined"},0,0,{"$f":"IF(ISBLANK($I31), \"Undefined\", IF(DA31<0.5, \"Complete\",IF(SUMPRODUCT($N$41:DA$41,$N31:DA31)<0.5, \"To start\", \"Running\")))","v":"Undefined"},0,0,{"$f":"IF(ISBLANK($I31), \"Undefined\", IF(DD31<0.5, \"Complete\",IF(SUMPRODUCT($N$41:DD$41,$N31:DD31)<0.5, \"To start\", \"Running\")))","v":"Undefined"},0,0,{"$f":"IF(ISBLANK($I31), \"Undefined\", IF(DG31<0.5, \"Complete\",IF(SUMPRODUCT($N$41:DG$41,$N31:DG31)<0.5, \"To start\", \"Running\")))","v":"Undefined"},0,0,{"$f":"IF(ISBLANK($I31), \"Undefined\", IF(DJ31<0.5, \"Complete\",IF(SUMPRODUCT($N$41:DJ$41,$N31:DJ31)<0.5, \"To start\", \"Running\")))","v":"Undefined"},0,0,{"$f":"IF(ISBLANK($I31), \"Undefined\", IF(DM31<0.5, \"Complete\",IF(SUMPRODUCT($N$41:DM$41,$N31:DM31)<0.5, \"To start\", \"Running\")))","v":"Undefined"},0,0,{"$f":"IF(ISBLANK($I31), \"Undefined\", IF(DP31<0.5, \"Complete\",IF(SUMPRODUCT($N$41:DP$41,$N31:DP31)<0.5, \"To start\", \"Running\")))","v":"Undefined"},0,0,{"$f":"IF(ISBLANK($I31), \"Undefined\", IF(DS31<0.5, \"Complete\",IF(SUMPRODUCT($N$41:DS$41,$N31:DS31)<0.5, \"To start\", \"Running\")))","v":"Undefined"},0,0,{"$f":"IF(ISBLANK($I31), \"Undefined\", IF(DV31<0.5, \"Complete\",IF(SUMPRODUCT($N$41:DV$41,$N31:DV31)<0.5, \"To start\", \"Running\")))","v":"Undefined"},0,0,{"$f":"IF(ISBLANK($I31), \"Undefined\", IF(DY31<0.5, \"Complete\",IF(SUMPRODUCT($N$41:DY$41,$N31:DY31)<0.5, \"To start\", \"Running\")))","v":"Undefined"},0,0,{"$f":"IF(ISBLANK($I31), \"Undefined\", IF(EB31<0.5, \"Complete\",IF(SUMPRODUCT($N$41:EB$41,$N31:EB31)<0.5, \"To start\", \"Running\")))","v":"Undefined"},null,{"$f":"SUMPRODUCT($L$41:DK$41,$L31:DK31)","v":0},0,{"$f":"OFFSET($O31,0,(Capacity!$F$2-SprintStart)*3,1,1)","v":0},0,0,0,"",0,0]
[{"$nulls":10},{"$f":"IF(SprintStart>Capacity!$F$2, \"To start\", INDEX(Burndown,ROW(K32)-ROW(K$6),MIN(Capacity!$F$2-SprintStart,29)*3+3))","v":"Undefined"},null,0,0,0,{"$f":"IF(ISBLANK($I32), \"Undefined\", IF(O32<0.5, \"Complete\",IF(SUMPRODUCT($N$41:O$41,$N32:O32)<0.5, \"To start\", \"Running\")))","v":"Undefined"},0,0,{"$f":"IF(ISBLANK($I32), \"Undefined\", IF(R32<0.5, \"Complete\",IF(SUMPRODUCT($N$41:R$41,$N32:R32)<0.5, \"To start\", \"Running\")))","v":"Undefined"},0,0,{"$f":"IF(ISBLANK($I32), \"Undefined\", IF(U32<0.5, \"Complete\",IF(SUMPRODUCT($N$41:U$41,$N32:U32)<0.5, \"To start\", \"Running\")))","v":"Undefined"},0,0,{"$f":"IF(ISBLANK($I32), \"Undefined\", IF(X32<0.5, \"Complete\",IF(SUMPRODUCT($N$41:X$41,$N32:X32)<0.5, \"To start\", \"Running\")))","v":"Undefined"},0,0,{"$f":"IF(ISBLANK($I32), \"Undefined\", IF(AA32<0.5, \"Complete\",IF(SUMPRODUCT($N$41:AA$41,$N32:AA32)<0.5, \"To start\", \"Running\")))","v":"Undefined"},0,0,{"$f":"IF(ISBLANK($I32), \"Undefined\", IF(AD32<0.5, \"Complete\",IF(SUMPRODUCT($N$41:AD$41,$N32:AD32)<0.5, \"To start\", \"Running\")))","v":"Undefined"},0,0,{"$f":"IF(ISBLANK($I32), \"Undefined\", IF(AG32<0.5, \"Complete\",IF(SUMPRODUCT($N$41:AG$41,$N32:AG32)<0.5, \"To start\", \"Running\")))","v":"Undefined"},0,0,{"$f":"IF(ISBLANK($I32), \"Undefined\", IF(AJ32<0.5, \"Complete\",IF(SUMPRODUCT($N$41:AJ$41,$N32:AJ32)<0.5, \"To start\", \"Running\")))","v":"Undefined"},0,0,{"$f":"IF(ISBLANK($I32), \"Undefined\", IF(AM32<0.5, \"Complete\",IF(SUMPRODUCT($N$41:AM$41,$N32:AM32)<0.5, \"To start\", \"Running\")))","v":"Undefined"},0,0,{"$f":"IF(ISBLANK($I32), \"Undefined\", IF(AP32<0.5, \"Complete\",IF(SUMPRODUCT($N$41:AP$41,$N32:AP32)<0.5, \"To start\", \"Running\")))","v":"Undefined"},0,0,{"$f":"IF(ISBLANK($I32), \"Undefined\", IF(AS32<0.5, \"Complete\",IF(SUMPRODUCT($N$41:AS$41,$N32:AS32)<0.5, \"To start\", \"Running\")))","v":"Undefined"},0,0,{"$f":"IF(ISBLANK($I32), \"Undefined\", IF(AV32<0.5, \"Complete\",IF(SUMPRODUCT($N$41:AV$41,$N32:AV32)<0.5, \"To start\", \"Running\")))","v":"Undefined"},0,0,{"$f":"IF(ISBLANK($I32), \"Undefined\", IF(AY32<0.5, \"Complete\",IF(SUMPRODUCT($N$41:AY$41,$N32:AY32)<0.5, \"To start\", \"Running\")))","v":"Undefined"},0,0,{"$f":"IF(ISBLANK($I32), \"Undefined\", IF(BB32<0.5, \"Complete\",IF(SUMPRODUCT($N$41:BB$41,$N32:BB32)<0.5, \"To start\", \"Running\")))","v":"Undefined"},0,0,{"$f":"IF(ISBLANK($I32), \"Undefined\", IF(BE32<0.5, \"Complete\",IF(SUMPRODUCT($N$41:BE$41,$N32:BE32)<0.5, \"To start\", \"Running\")))","v":"Undefined"},0,0,{"$f":"IF(ISBLANK($I32), \"Undefined\", IF(BH32<0.5, \"Complete\",IF(SUMPRODUCT($N$41:BH$41,$N32:BH32)<0.5, \"To start\", \"Running\")))","v":"Undefined"},0,0,{"$f":"IF(ISBLANK($I32), \"Undefined\", IF(BK32<0.5, \"Complete\",IF(SUMPRODUCT($N$41:BK$41,$N32:BK32)<0.5, \"To start\", \"Running\")))","v":"Undefined"},0,0,{"$f":"IF(ISBLANK($I32), \"Undefined\", IF(BN32<0.5, \"Complete\",IF(SUMPRODUCT($N$41:BN$41,$N32:BN32)<0.5, \"To start\", \"Running\")))","v":"Undefined"},0,0,{"$f":"IF(ISBLANK($I32), \"Undefined\", IF(BQ32<0.5, \"Complete\",IF(SUMPRODUCT($N$41:BQ$41,$N32:BQ32)<0.5, \"To start\", \"Running\")))","v":"Undefined"},0,0,{"$f":"IF(ISBLANK($I32), \"Undefined\", IF(BT32<0.5, \"Complete\",IF(SUMPRODUCT($N$41:BT$41,$N32:BT32)<0.5, \"To start\", \"Running\")))","v":"Undefined"},0,0,{"$f":"IF(ISBLANK($I32), \"Undefined\", IF(BW32<0.5, \"Complete\",IF(SUMPRODUCT($N$41:BW$41,$N32:BW32)<0.5, \"To start\", \"Running\")))","v":"Undefined"},0,0,{"$f":"IF(ISBLANK($I32), \"Undefined\", IF(BZ32<0.5, \"Complete\",IF(SUMPRODUCT($N$41:BZ$41,$N32:BZ32)<0.5, \"To start\", \"Running\")))","v":"Undefined"},0,0,{"$f":"IF(ISBLANK($I32), \"Undefined\", IF(CC32<0.5, \"Complete\",IF(SUMPRODUCT($N$41:CC$41,$N32:CC32)<0.5, \"To start\", \"Running\")))","v":"Undefined"},0,0,{"$f":"IF(ISBLANK($I32), \"Undefined\", IF(CF32<0.5, \"Complete\",IF(SUMPRODUCT($N$41:CF$41,$N32:CF32)<0.5, \"To start\", \"Running\")))","v":"Undefined"},0,0,{"$f":"IF(ISBLANK($I32), \"Undefined\", IF(CI32<0.5, \"Complete\",IF(SUMPRODUCT($N$41:CI$41,$N32:CI32)<0.5, \"To start\", \"Running\")))","v":"Undefined"},0,0,{"$f":"IF(ISBLANK($I32), \"Undefined\", IF(CL32<0.5, \"Complete\",IF(SUMPRODUCT($N$41:CL$41,$N32:CL32)<0.5, \"To start\", \"Running\")))","v":"Undefined"},0,0,{"$f":"IF(ISBLANK($I32), \"Undefined\", IF(CO32<0.5, \"Complete\",IF(SUMPRODUCT($N$41:CO$41,$N32:CO32)<0.5, \"To start\", \"Running\")))","v":"Undefined"},0,0,{"$f":"IF(ISBLANK($I32), \"Undefined\", IF(CR32<0.5, \"Complete\",IF(SUMPRODUCT($N$41:CR$41,$N32:CR32)<0.5, \"To start\", \"Running\")))","v":"Undefined"},0,0,{"$f":"IF(ISBLANK($I32), \"Undefined\", IF(CU32<0.5, \"Complete\",IF(SUMPRODUCT($N$41:CU$41,$N32:CU32)<0.5, \"To start\", \"Running\")))","v":"Undefined"},0,0,{"$f":"IF(ISBLANK($I32), \"Undefined\", IF(CX32<0.5, \"Complete\",IF(SUMPRODUCT($N$41:CX$41,$N32:CX32)<0.5, \"To start\", \"Running\")))","v":"Undefined"},0,0,{"$f":"IF(ISBLANK($I32), \"Undefined\", IF(DA32<0.5, \"Complete\",IF(SUMPRODUCT($N$41:DA$41,$N32:DA32)<0.5, \"To start\", \"Running\")))","v":"Undefined"},0,0,{"$f":"IF(ISBLANK($I32), \"Undefined\", IF(DD32<0.5, \"Complete\",IF(SUMPRODUCT($N$41:DD$41,$N32:DD32)<0.5, \"To start\", \"Running\")))","v":"Undefined"},0,0,{"$f":"IF(ISBLANK($I32), \"Undefined\", IF(DG32<0.5, \"Complete\",IF(SUMPRODUCT($N$41:DG$41,$N32:DG32)<0.5, \"To start\", \"Running\")))","v":"Undefined"},0,0,{"$f":"IF(ISBLANK($I32), \"Undefined\", IF(DJ32<0.5, \"Complete\",IF(SUMPRODUCT($N$41:DJ$41,$N32:DJ32)<0.5, \"To start\", \"Running\")))","v":"Undefined"},0,0,{"$f":"IF(ISBLANK($I32), \"Undefined\", IF(DM32<0.5, \"Complete\",IF(SUMPRODUCT($N$41:DM$41,$N32:DM32)<0.5, \"To start\", \"Running\")))","v":"Undefined"},0,0,{"$f":"IF(ISBLANK($I32), \"Undefined\", IF(DP32<0.5, \"Complete\",IF(SUMPRODUCT($N$41:DP$41,$N32:DP32)<0.5, \"To start\", \"Running\")))","v":"Undefined"},0,0,{"$f":"IF(ISBLANK($I32), \"Undefined\", IF(DS32<0.5, \"Complete\",IF(SUMPRODUCT($N$41:DS$41,$N32:DS32)<0.5, \"To start\", \"Running\")))","v":"Undefined"},0,0,{"$f":"IF(ISBLANK($I32), \"Undefined\", IF(DV32<0.5, \"Complete\",IF(SUMPRODUCT($N$41:DV$41,$N32:DV32)<0.5, \"To start\", \"Running\")))","v":"Undefined"},0,0,{"$f":"IF(ISBLANK($I32), \"Undefined\", IF(DY32<0.5, \"Complete\",IF(SUMPRODUCT($N$41:DY$41,$N32:DY32)<0.5, \"To start\", \"Running\")))","v":"Undefined"},0,0,{"$f":"IF(ISBLANK($I32), \"Undefined\", IF(EB32<0.5, \"Complete\",IF(SUMPRODUCT($N$41:EB$41,$N32:EB32)<0.5, \"To start\", \"Running\")))","v":"Undefined"},null,{"$f":"SUMPRODUCT($L$41:DK$41,$L32:DK32)","v":0},0,{"$f":"OFFSET($O32,0,(Capacity!$F$2-SprintStart)*3,1,1)","v":0},0,0,0,"",0,0]
[{"$nulls":10},{"$f":"IF(SprintStart>Capacity!$F$2, \"To start\", INDEX(Burndown,ROW(K33)-ROW(K$6),MIN(Capacity!$F$2-SprintStart,29)*3+3))","v":"Undefined"},null,0,0,0,{"$f":"IF(ISBLANK($I33), \"Undefined\", IF(O33<0.5, \"Complete\",IF(SUMPRODUCT($N$41:O$41,$N33:O33)<0.5, \"To start\", \"Running\")))","v":"Undefined"},0,0,{"$f":"IF(ISBLANK($I33), \"Undefined\", IF(R33<0.5, \"Complete\",IF(SUMPRODUCT($N$41:R$41,$N33:R33)<0.5, \"To start\", \"Running\")))","v":"Undefined"},0,0,{"$f":"IF(ISBLANK($I33), \"Undefined\", IF(U33<0.5, \"Complete\",IF(SUMPRODUCT($N$41:U$41,$N33:U33)<0.5, \"To start\", \"Running\")))","v":"Undefined"},0,0,{"$f":"IF(ISBLANK($I33), \"Undefined\", IF(X33<0.5, \"Complete\",IF(SUMPRODUCT($N$41:X$41,$N33:X33)<0.5, \"To start\", \"Running\")))","v":"Undefined"},0,0,{"$f":"IF(ISBLANK($I33), \"Undefined\", IF(AA33<0.5, \"Complete\",IF(SUMPRODUCT($N$41:AA$41,$N33:AA33)<0.5, \"To start\", \"Running\")))","v":"Undefined"},0,0,{"$f":"IF(ISBLANK($I33), \"Undefined\", IF(AD33<0.5, \"Complete\",IF(SUMPRODUCT($N$41:AD$41,$N33:AD33)<0.5, \"To start\", \"Running\")))","v":"Undefined"},0,0,{"$f":"IF(ISBLANK($I33), \"Undefined\", IF(AG33<0.5, \"Complete\",IF(SUMPRODUCT($N$41:AG$41,$N33:AG33)<0.5, \"To start\", \"Running\")))","v":"Undefined"},0,0,{"$f":"IF(ISBLANK($I33), \"Undefined\", IF(AJ33<0.5, \"Complete\",IF(SUMPRODUCT($N$41:AJ$41,$N33:AJ33)<0.5, \"To start\", \"Running\")))","v":"Undefined"},0,0,{"$f":"IF(ISBLANK($I33), \"Undefined\", IF(AM33<0.5, \"Complete\",IF(SUMPRODUCT($N$41:AM$41,$N33:AM33)<0.5, \"To start\", \"Running\")))","v":"Undefined"},0,0,{"$f":"IF(ISBLANK($I33), \"Undefined\", IF(AP33<0.5, \"Complete\",IF(SUMPRODUCT($N$41:AP$41,$N33:AP33)<0.5, \"To start\", \"Running\")))","v":"Undefined"},0,0,{"$f":"IF(ISBLANK($I33), \"Undefined\", IF(AS33<0.5, \"Complete\",IF(SUMPRODUCT($N$41:AS$41,$N33:AS33)<0.5, \"To start\", \"Running\")))","v":"Undefined"},0,0,{"$f":"IF(ISBLANK($I33), \"Undefined\", IF(AV33<0.5, \"Complete\",IF(SUMPRODUCT($N$41:AV$41,$N33:AV33)<0.5, \"To start\", \"Running\")))","v":"Undefined"},0,0,{"$f":"IF(ISBLANK($I33), \"Undefined\", IF(AY33<0.5, \"Complete\",IF(SUMPRODUCT($N$41:AY$41,$N33:AY33)<0.5, \"To start\", \"Running\")))","v":"Undefined"},0,0,{"$f":"IF(ISBLANK($I33), \"Undefined\", IF(BB33<0.5, \"Complete\",IF(SUMPRODUCT($N$41:BB$41,$N33:BB33)<0.5, \"To start\", \"Running\")))","v":"Undefined"},0,0,{"$f":"IF(ISBLANK($I33), \"Undefined\", IF(BE33<0.5, \"Complete\",IF(SUMPRODUCT($N$41:BE$41,$N33:BE33)<0.5, \"To start\", \"Running\")))","v":"Undefined"},0,0,{"$f":"IF(ISBLANK($I33), \"Undefined\", IF(BH33<0.5, \"Complete\",IF(SUMPRODUCT($N$41:BH$41,$N33:BH33)<0.5, \"To start\", \"Running\")))","v":"Undefined"},0,0,{"$f":"IF(ISBLANK($I33), \"Undefined\", IF(BK33<0.5, \"Complete\",IF(SUMPRODUCT($N$41:BK$41,$N33:BK33)<0.5, \"To start\", \"Running\")))","v":"Undefined"},0,0,{"$f":"IF(ISBLANK($I33), \"Undefined\", IF(BN33<0.5, \"Complete\",IF(SUMPRODUCT($N$41:BN$41,$N33:BN33)<0.5, \"To start\", \"Running\")))","v":"Undefined"},0,0,{"$f":"IF(ISBLANK($I33), \"Undefined\", IF(BQ33<0.5, \"Complete\",IF(SUMPRODUCT($N$41:BQ$41,$N33:BQ33)<0.5, \"To start\", \"Running\")))","v":"Undefined"},0,0,{"$f":"IF(ISBLANK($I33), \"Undefined\", IF(BT33<0.5, \"Complete\",IF(SUMPRODUCT($N$41:BT$41,$N33:BT33)<0.5, \"To start\", \"Running\")))","v":"Undefined"},0,0,{"$f":"IF(ISBLANK($I33), \"Undefined\", IF(BW33<0.5, \"Complete\",IF(SUMPRODUCT($N$41:BW$41,$N33:BW33)<0.5, \"To start\", \"Running\")))","v":"Undefined"},0,0,{"$f":"IF(ISBLANK($I33), \"Undefined\", IF(BZ33<0.5, \"Complete\",IF(SUMPRODUCT($N$41:BZ$41,$N33:BZ33)<0.5, \"To start\", \"Running\")))","v":"Undefined"},0,0,{"$f":"IF(ISBLANK($I33), \"Undefined\", IF(CC33<0.5, \"Complete\",IF(SUMPRODUCT($N$41:CC$41,$N33:CC33)<0.5, \"To start\", \"Running\")))","v":"Undefined"},0,0,{"$f":"IF(ISBLANK($I33), \"Undefined\", IF(CF33<0.5, \"Complete\",IF(SUMPRODUCT($N$41:CF$41,$N33:CF33)<0.5, \"To start\", \"Running\")))","v":"Undefined"},0,0,{"$f":"IF(ISBLANK($I33), \"Undefined\", IF(CI33<0.5, \"Complete\",IF(SUMPRODUCT($N$41:CI$41,$N33:CI33)<0.5, \"To start\", \"Running\")))","v":"Undefined"},0,0,{"$f":"IF(ISBLANK($I33), \"Undefined\", IF(CL33<0.5, \"Complete\",IF(SUMPRODUCT($N$41:CL$41,$N33:CL33)<0.5, \"To start\", \"Running\")))","v":"Undefined"},0,0,{"$f":"IF(ISBLANK($I33), \"Undefined\", IF(CO33<0.5, \"Complete\",IF(SUMPRODUCT($N$41:CO$41,$N33:CO33)<0.5, \"To start\", \"Running\")))","v":"Undefined"},0,0,{"$f":"IF(ISBLANK($I33), \"Undefined\", IF(CR33<0.5, \"Complete\",IF(SUMPRODUCT($N$41:CR$41,$N33:CR33)<0.5, \"To start\", \"Running\")))","v":"Undefined"},0,0,{"$f":"IF(ISBLANK($I33), \"Undefined\", IF(CU33<0.5, \"Complete\",IF(SUMPRODUCT($N$41:CU$41,$N33:CU33)<0.5, \"To start\", \"Running\")))","v":"Undefined"},0,0,{"$f":"IF(ISBLANK($I33), \"Undefined\", IF(CX33<0.5, \"Complete\",IF(SUMPRODUCT($N$41:CX$41,$N33:CX33)<0.5, \"To start\", \"Running\")))","v":"Undefined"},0,0,{"$f":"IF(ISBLANK($I33), \"Undefined\", IF(DA33<0.5, \"Complete\",IF(SUMPRODUCT($N$41:DA$41,$N33:DA33)<0.5, \"To start\", \"Running\")))","v":"Undefined"},0,0,{"$f":"IF(ISBLANK($I33), \"Undefined\", IF(DD33<0.5, \"Complete\",IF(SUMPRODUCT($N$41:DD$41,$N33:DD33)<0.5, \"To start\", \"Running\")))","v":"Undefined"},0,0,{"$f":"IF(ISBLANK($I33), \"Undefined\", IF(DG33<0.5, \"Complete\",IF(SUMPRODUCT($N$41:DG$41,$N33:DG33)<0.5, \"To start\", \"Running\")))","v":"Undefined"},0,0,{"$f":"IF(ISBLANK($I33), \"Undefined\", IF(DJ33<0.5, \"Complete\",IF(SUMPRODUCT($N$41:DJ$41,$N33:DJ33)<0.5, \"To start\", \"Running\")))","v":"Undefined"},0,0,{"$f":"IF(ISBLANK($I33), \"Undefined\", IF(DM33<0.5, \"Complete\",IF(SUMPRODUCT($N$41:DM$41,$N33:DM33)<0.5, \"To start\", \"Running\")))","v":"Undefined"},0,0,{"$f":"IF(ISBLANK($I33), \"Undefined\", IF(DP33<0.5, \"Complete\",IF(SUMPRODUCT($N$41:DP$41,$N33:DP33)<0.5, \"To start\", \"Running\")))","v":"Undefined"},0,0,{"$f":"IF(ISBLANK($I33), \"Undefined\", IF(DS33<0.5, \"Complete\",IF(SUMPRODUCT($N$41:DS$41,$N33:DS33)<0.5, \"To start\", \"Running\")))","v":"Undefined"},0,0,{"$f":"IF(ISBLANK($I33), \"Undefined\", IF(DV33<0.5, \"Complete\",IF(SUMPRODUCT($N$41:DV$41,$N33:DV33)<0.5, \"To start\", \"Running\")))","v":"Undefined"},0,0,{"$f":"IF(ISBLANK($I33), \"Undefined\", IF(DY33<0.5, \"Complete\",IF(SUMPRODUCT($N$41:DY$41,$N33:DY33)<0.5, \"To start\", \"Running\")))","v":"Undefined"},0,0,{"$f":"IF(ISBLANK($I33), \"Undefined\", IF(EB33<0.5, \"Complete\",IF(SUMPRODUCT($N$41:EB$41,$N33:EB33)<0.5, \"To start\", \"Running\")))","v":"Undefined"},null,{"$f":"SUMPRODUCT($L$41:DK$41,$L33:DK33)","v":0},0,{"$f":"OFFSET($O33,0,(Capacity!$F$2-SprintStart)*3,1,1)","v":0},0,0,0,"",0,0]
[{"$nulls":10},{"$f":"IF(SprintStart>Capacity!$F$2, \"To start\", INDEX(Burndown,ROW(K34)-ROW(K$6),MIN(Capacity!$F$2-SprintStart,29)*3+3))","v":"Undefined"},null,0,0,0,{"$f":"IF(ISBLANK($I34), \"Undefined\", IF(O34<0.5, \"Complete\",IF(SUMPRODUCT($N$41:O$41,$N34:O34)<0.5, \"To start\", \"Running\")))","v":"Undefined"},0,0,{"$f":"IF(ISBLANK($I34), \"Undefined\", IF(R34<0.5, \"Complete\",IF(SUMPRODUCT($N$41:R$41,$N34:R34)<0.5, \"To start\", \"Running\")))","v":"Undefined"},0,0,{"$f":"IF(ISBLANK($I34), \"Undefined\", IF(U34<0.5, \"Complete\",IF(SUMPRODUCT($N$41:U$41,$N34:U34)<0.5, \"To start\", \"Running\")))","v":"Undefined"},0,0,{"$f":"IF(ISBLANK($I34), \"Undefined\", IF(X34<0.5, \"Complete\",IF(SUMPRODUCT($N$41:X$41,$N34:X34)<0.5, \"To start\", \"Running\")))","v":"Undefined"},0,0,{"$f":"IF(ISBLANK($I34), \"Undefined\", IF(AA34<0.5, \"Complete\",IF(SUMPRODUCT($N$41:AA$41,$N34:AA34)<0.5, \"To start\", \"Running\")))","v":"Undefined"},0,0,{"$f":"IF(ISBLANK($I34), \"Undefined\", IF(AD34<0.5, \"Complete\",IF(SUMPRODUCT($N$41:AD$41,$N34:AD34)<0.5, \"To start\", \"Running\")))","v":"Undefined"},0,0,{"$f":"IF(ISBLANK($I34), \"Undefined\", IF(AG34<0.5, \"Complete\",IF(SUMPRODUCT($N$41:AG$41,$N34:AG34)<0.5, \"To start\", \"Running\")))","v":"Undefined"},0,0,{"$f":"IF(ISBLANK($I34), \"Undefined\", IF(AJ34<0.5, \"Complete\",IF(SUMPRODUCT($N$41:AJ$41,$N34:AJ34)<0.5, \"To start\", \"Running\")))","v":"Undefined"},0,0,{"$f":"IF(ISBLANK($I34), \"Undefined\", IF(AM34<0.5, \"Complete\",IF(SUMPRODUCT($N$41:AM$41,$N34:AM34)<0.5, \"To start\", \"Running\")))","v":"Undefined"},0,0,{"$f":"IF(ISBLANK($I34), \"Undefined\", IF(AP34<0.5, \"Complete\",IF(SUMPRODUCT($N$41:AP$41,$N34:AP34)<0.5, \"To start\", \"Running\")))","v":"Undefined"},0,0,{"$f":"IF(ISBLANK($I34), \"Undefined\", IF(AS34<0.5, \"Complete\",IF(SUMPRODUCT($N$41:AS$41,$N34:AS34)<0.5, \"To start\", \"Running\")))","v":"Undefined"},0,0,{"$f":"IF(ISBLANK($I34), \"Undefined\", IF(AV34<0.5, \"Complete\",IF(SUMPRODUCT($N$41:AV$41,$N34:AV34)<0.5, \"To start\", \"Running\")))","v":"Undefined"},0,0,{"$f":"IF(ISBLANK($I34), \"Undefined\", IF(AY34<0.5, \"Complete\",IF(SUMPRODUCT($N$41:AY$41,$N34:AY34)<0.5, \"To start\", \"Running\")))","v":"Undefined"},0,0,{"$f":"IF(ISBLANK($I34), \"Undefined\", IF(BB34<0.5, \"Complete\",IF(SUMPRODUCT($N$41:BB$41,$N34:BB34)<0.5, \"To start\", \"Running\")))","v":"Undefined"},0,0,{"$f":"IF(ISBLANK($I34), \"Undefined\", IF(BE34<0.5, \"Complete\",IF(SUMPRODUCT($N$41:BE$41,$N34:BE34)<0.5, \"To start\", \"Running\")))","v":"Undefined"},0,0,{"$f":"IF(ISBLANK($I34), \"Undefined\", IF(BH34<0.5, \"Complete\",IF(SUMPRODUCT($N$41:BH$41,$N34:BH34)<0.5, \"To start\", \"Running\")))","v":"Undefined"},0,0,{"$f":"IF(ISBLANK($I34), \"Undefined\", IF(BK34<0.5, \"Complete\",IF(SUMPRODUCT($N$41:BK$41,$N34:BK34)<0.5, \"To start\", \"Running\")))","v":"Undefined"},0,0,{"$f":"IF(ISBLANK($I34), \"Undefined\", IF(BN34<0.5, \"Complete\",IF(SUMPRODUCT($N$41:BN$41,$N34:BN34)<0.5, \"To start\", \"Running\")))","v":"Undefined"},0,0,{"$f":"IF(ISBLANK($I34), \"Undefined\", IF(BQ34<0.5, \"Complete\",IF(SUMPRODUCT($N$41:BQ$41,$N34:BQ34)<0.5, \"To start\", \"Running\")))","v":"Undefined"},0,0,{"$f":"IF(ISBLANK($I34), \"Undefined\", IF(BT34<0.5, \"Complete\",IF(SUMPRODUCT($N$41:BT$41,$N34:BT34)<0.5, \"To start\", \"Running\")))","v":"Undefined"},0,0,{"$f":"IF(ISBLANK($I34), \"Undefined\", IF(BW34<0.5, \"Complete\",IF(SUMPRODUCT($N$41:BW$41,$N34:BW34)<0.5, \"To start\", \"Running\")))","v":"Undefined"},0,0,{"$f":"IF(ISBLANK($I34), \"Undefined\", IF(BZ34<0.5, \"Complete\",IF(SUMPRODUCT($N$41:BZ$41,$N34:BZ34)<0.5, \"To start\", \"Running\")))","v":"Undefined"},0,0,{"$f":"IF(ISBLANK($I34), \"Undefined\", IF(CC34<0.5, \"Complete\",IF(SUMPRODUCT($N$41:CC$41,$N34:CC34)<0.5, \"To start\", \"Running\")))","v":"Undefined"},0,0,{"$f":"IF(ISBLANK($I34), \"Undefined\", IF(CF34<0.5, \"Complete\",IF(SUMPRODUCT($N$41:CF$41,$N34:CF34)<0.5, \"To start\", \"Running\")))","v":"Undefined"},0,0,{"$f":"IF(ISBLANK($I34), \"Undefined\", IF(CI34<0.5, \"Complete\",IF(SUMPRODUCT($N$41:CI$41,$N34:CI34)<0.5, \"To start\", \"Running\")))","v":"Undefined"},0,0,{"$f":"IF(ISBLANK($I34), \"Undefined\", IF(CL34<0.5, \"Complete\",IF(SUMPRODUCT($N$41:CL$41,$N34:CL34)<0.5, \"To start\", \"Running\")))","v":"Undefined"},0,0,{"$f":"IF(ISBLANK($I34), \"Undefined\", IF(CO34<0.5, \"Complete\",IF(SUMPRODUCT($N$41:CO$41,$N34:CO34)<0.5, \"To start\", \"Running\")))","v":"Undefined"},0,0,{"$f":"IF(ISBLANK($I34), \"Undefined\", IF(CR34<0.5, \"Complete\",IF(SUMPRODUCT($N$41:CR$41,$N34:CR34)<0.5, \"To start\", \"Running\")))","v":"Undefined"},0,0,{"$f":"IF(ISBLANK($I34), \"Undefined\", IF(CU34<0.5, \"Complete\",IF(SUMPRODUCT($N$41:CU$41,$N34:CU34)<0.5, \"To start\", \"Running\")))","v":"Undefined"},0,0,{"$f":"IF(ISBLANK($I34), \"Undefined\", IF(CX34<0.5, \"Complete\",IF(SUMPRODUCT($N$41:CX$41,$N34:CX34)<0.5, \"To start\", \"Running\")))","v":"Undefined"},0,0,{"$f":"IF(ISBLANK($I34), \"Undefined\", IF(DA34<0.5, \"Complete\",IF(SUMPRODUCT($N$41:DA$41,$N34:DA34)<0.5, \"To start\", \"Running\")))","v":"Undefined"},0,0,{"$f":"IF(ISBLANK($I34), \"Undefined\", IF(DD34<0.5, \"Complete\",IF(SUMPRODUCT($N$41:DD$41,$N34:DD34)<0.5, \"To start\", \"Running\")))","v":"Undefined"},0,0,{"$f":"IF(ISBLANK($I34), \"Undefined\", IF(DG34<0.5, \"Complete\",IF(SUMPRODUCT($N$41:DG$41,$N34:DG34)<0.5, \"To start\", \"Running\")))","v":"Undefined"},0,0,{"$f":"IF(ISBLANK($I34), \"Undefined\", IF(DJ34<0.5, \"Complete\",IF(SUMPRODUCT($N$41:DJ$41,$N34:DJ34)<0.5, \"To start\", \"Running\")))","v":"Undefined"},0,0,{"$f":"IF(ISBLANK($I34), \"Undefined\", IF(DM34<0.5, \"Complete\",IF(SUMPRODUCT($N$41:DM$41,$N34:DM34)<0.5, \"To start\", \"Running\")))","v":"Undefined"},0,0,{"$f":"IF(ISBLANK($I34), \"Undefined\", IF(DP34<0.5, \"Complete\",IF(SUMPRODUCT($N$41:DP$41,$N34:DP34)<0.5, \"To start\", \"Running\")))","v":"Undefined"},0,0,{"$f":"IF(ISBLANK($I34), \"Undefined\", IF(DS34<0.5, \"Complete\",IF(SUMPRODUCT($N$41:DS$41,$N34:DS34)<0.5, \"To start\", \"Running\")))","v":"Undefined"},0,0,{"$f":"IF(ISBLANK($I34), \"Undefined\", IF(DV34<0.5, \"Complete\",IF(SUMPRODUCT($N$41:DV$41,$N34:DV34)<0.5, \"To start\", \"Running\")))","v":"Undefined"},0,0,{"$f":"IF(ISBLANK($I34), \"Undefined\", IF(DY34<0.5, \"Complete\",IF(SUMPRODUCT($N$41:DY$41,$N34:DY34)<0.5, \"To start\", \"Running\")))","v":"Undefined"},0,0,{"$f":"IF(ISBLANK($I34), \"Undefined\", IF(EB34<0.5, \"Complete\",IF(SUMPRODUCT($N$41:EB$41,$N34:EB34)<0.5, \"To start\", \"Running\")))","v":"Undefined"},null,{"$f":"SUMPRODUCT($L$41:DK$41,$L34:DK34)","v":0},0,{"$f":"OFFSET($O34,0,(Capacity!$F$2-SprintStart)*3,1,1)","v":0},0,0,0,"",0,0]
[{"$nulls":10},{"$f":"IF(SprintStart>Capacity!$F$2, \"To start\", INDEX(Burndown,ROW(K35)-ROW(K$6),MIN(Capacity!$F$2-SprintStart,29)*3+3))","v":"Undefined"},null,0,0,0,{"$f":"IF(ISBLANK($I35), \"Undefined\", IF(O35<0.5, \"Complete\",IF(SUMPRODUCT($N$41:O$41,$N35:O35)<0.5, \"To start\", \"Running\")))","v":"Undefined"},0,0,{"$f":"IF(ISBLANK($I35), \"Undefined\", IF(R35<0.5, \"Complete\",IF(SUMPRODUCT($N$41:R$41,$N35:R35)<0.5, \"To start\", \"Running\")))","v":"Undefined"},0,0,{"$f":"IF(ISBLANK($I35), \"Undefined\", IF(U35<0.5, \"Complete\",IF(SUMPRODUCT($N$41:U$41,$N35:U35)<0.5, \"To start\", \"Running\")))","v":"Undefined"},0,0,{"$f":"IF(ISBLANK($I35), \"Undefined\", IF(X35<0.5, \"Complete\",IF(SUMPRODUCT($N$41:X$41,$N35:X35)<0.5, \"To start\", \"Running\")))","v":"Undefined"},0,0,{"$f":"IF(ISBLANK($I35), \"Undefined\", IF(AA35<0.5, \"Complete\",IF(SUMPRODUCT($N$41:AA$41,$N35:AA35)<0.5, \"To start\", \"Running\")))","v":"Undefined"},0,0,{"$f":"IF(ISBLANK($I35), \"Undefined\", IF(AD35<0.5, \"Complete\",IF(SUMPRODUCT($N$41:AD$41,$N35:AD35)<0.5, \"To start\", \"Running\")))","v":"Undefined"},0,0,{"$f":"IF(ISBLANK($I35), \"Undefined\", IF(AG35<0.5, \"Complete\",IF(SUMPRODUCT($N$41:AG$41,$N35:AG35)<0.5, \"To start\", \"Running\")))","v":"Undefined"},0,0,{"$f":"IF(ISBLANK($I35), \"Undefined\", IF(AJ35<0.5, \"Complete\",IF(SUMPRODUCT($N$41:AJ$41,$N35:AJ35)<0.5, \"To start\", \"Running\")))","v":"Undefined"},0,0,{"$f":"IF(ISBLANK($I35), \"Undefined\", IF(AM35<0.5, \"Complete\",IF(SUMPRODUCT($N$41:AM$41,$N35:AM35)<0.5, \"To start\", \"Running\")))","v":"Undefined"},0,0,{"$f":"IF(ISBLANK($I35), \"Undefined\", IF(AP35<0.5, \"Complete\",IF(SUMPRODUCT($N$41:AP$41,$N35:AP35)<0.5, \"To start\", \"Running\")))","v":"Undefined"},0,0,{"$f":"IF(ISBLANK($I35), \"Undefined\", IF(AS35<0.5, \"Complete\",IF(SUMPRODUCT($N$41:AS$41,$N35:AS35)<0.5, \"To start\", \"Running\")))","v":"Undefined"},0,0,{"$f":"IF(ISBLANK($I35), \"Undefined\", IF(AV35<0.5, \"Complete\",IF(SUMPRODUCT($N$41:AV$41,$N35:AV35)<0.5, \"To start\", \"Running\")))","v":"Undefined"},0,0,{"$f":"IF(ISBLANK($I35), \"Undefined\", IF(AY35<0.5, \"Complete\",IF(SUMPRODUCT($N$41:AY$41,$N35:AY35)<0.5, \"To start\", \"Running\")))","v":"Undefined"},0,0,{"$f":"IF(ISBLANK($I35), \"Undefined\", IF(BB35<0.5, \"Complete\",IF(SUMPRODUCT($N$41:BB$41,$N35:BB35)<0.5, \"To start\", \"Running\")))","v":"Undefined"},0,0,{"$f":"IF(ISBLANK($I35), \"Undefined\", IF(BE35<0.5, \"Complete\",IF(SUMPRODUCT($N$41:BE$41,$N35:BE35)<0.5, \"To start\", \"Running\")))","v":"Undefined"},0,0,{"$f":"IF(ISBLANK($I35), \"Undefined\", IF(BH35<0.5, \"Complete\",IF(SUMPRODUCT($N$41:BH$41,$N35:BH35)<0.5, \"To start\", \"Running\")))","v":"Undefined"},0,0,{"$f":"IF(ISBLANK($I35), \"Undefined\", IF(BK35<0.5, \"Complete\",IF(SUMPRODUCT($N$41:BK$41,$N35:BK35)<0.5, \"To start\", \"Running\")))","v":"Undefined"},0,0,{"$f":"IF(ISBLANK($I35), \"Undefined\", IF(BN35<0.5, \"Complete\",IF(SUMPRODUCT($N$41:BN$41,$N35:BN35)<0.5, \"To start\", \"Running\")))","v":"Undefined"},0,0,{"$f":"IF(ISBLANK($I35), \"Undefined\", IF(BQ35<0.5, \"Complete\",IF(SUMPRODUCT($N$41:BQ$41,$N35:BQ35)<0.5, \"To start\", \"Running\")))","v":"Undefined"},0,0,{"$f":"IF(ISBLANK($I35), \"Undefined\", IF(BT35<0.5, \"Complete\",IF(SUMPRODUCT($N$41:BT$41,$N35:BT35)<0.5, \"To start\", \"Running\")))","v":"Undefined"},0,0,{"$f":"IF(ISBLANK($I35), \"Undefined\", IF(BW35<0.5, \"Complete\",IF(SUMPRODUCT($N$41:BW$41,$N35:BW35)<0.5, \"To start\", \"Running\")))","v":"Undefined"},0,0,{"$f":"IF(ISBLANK($I35), \"Undefined\", IF(BZ35<0.5, \"Complete\",IF(SUMPRODUCT($N$41:BZ$41,$N35:BZ35)<0.5, \"To start\", \"Running\")))","v":"Undefined"},0,0,{"$f":"IF(ISBLANK($I35), \"Undefined\", IF(CC35<0.5, \"Complete\",IF(SUMPRODUCT($N$41:CC$41,$N35:CC35)<0.5, \"To start\", \"Running\")))","v":"Undefined"},0,0,{"$f":"IF(ISBLANK($I35), \"Undefined\", IF(CF35<0.5, \"Complete\",IF(SUMPRODUCT($N$41:CF$41,$N35:CF35)<0.5, \"To start\", \"Running\")))","v":"Undefined"},0,0,{"$f":"IF(ISBLANK($I35), \"Undefined\", IF(CI35<0.5, \"Complete\",IF(SUMPRODUCT($N$41:CI$41,$N35:CI35)<0.5, \"To start\", \"Running\")))","v":"Undefined"},0,0,{"$f":"IF(ISBLANK($I35), \"Undefined\", IF(CL35<0.5, \"Complete\",IF(SUMPRODUCT($N$41:CL$41,$N35:CL35)<0.5, \"To start\", \"Running\")))","v":"Undefined"},0,0,{"$f":"IF(ISBLANK($I35), \"Undefined\", IF(CO35<0.5, \"Complete\",IF(SUMPRODUCT($N$41:CO$41,$N35:CO35)<0.5, \"To start\", \"Running\")))","v":"Undefined"},0,0,{"$f":"IF(ISBLANK($I35), \"Undefined\", IF(CR35<0.5, \"Complete\",IF(SUMPRODUCT($N$41:CR$41,$N35:CR35)<0.5, \"To start\", \"Running\")))","v":"Undefined"},0,0,{"$f":"IF(ISBLANK($I35), \"Undefined\", IF(CU35<0.5, \"Complete\",IF(SUMPRODUCT($N$41:CU$41,$N35:CU35)<0.5, \"To start\", \"Running\")))","v":"Undefined"},0,0,{"$f":"IF(ISBLANK($I35), \"Undefined\", IF(CX35<0.5, \"Complete\",IF(SUMPRODUCT($N$41:CX$41,$N35:CX35)<0.5, \"To start\", \"Running\")))","v":"Undefined"},0,0,{"$f":"IF(ISBLANK($I35), \"Undefined\", IF(DA35<0.5, \"Complete\",IF(SUMPRODUCT($N$41:DA$41,$N35:DA35)<0.5, \"To start\", \"Running\")))","v":"Undefined"},0,0,{"$f":"IF(ISBLANK($I35), \"Undefined\", IF(DD35<0.5, \"Complete\",IF(SUMPRODUCT($N$41:DD$41,$N35:DD35)<0.5, \"To start\", \"Running\")))","v":"Undefined"},0,0,{"$f":"IF(ISBLANK($I35), \"Undefined\", IF(DG35<0.5, \"Complete\",IF(SUMPRODUCT($N$41:DG$41,$N35:DG35)<0.5, \"To start\", \"Running\")))","v":"Undefined"},0,0,{"$f":"IF(ISBLANK($I35), \"Undefined\", IF(DJ35<0.5, \"Complete\",IF(SUMPRODUCT($N$41:DJ$41,$N35:DJ35)<0.5, \"To start\", \"Running\")))","v":"Undefined"},0,0,{"$f":"IF(ISBLANK($I35), \"Undefined\", IF(DM35<0.5, \"Complete\",IF(SUMPRODUCT($N$41:DM$41,$N35:DM35)<0.5, \"To start\", \"Running\")))","v":"Undefined"},0,0,{"$f":"IF(ISBLANK($I35), \"Undefined\", IF(DP35<0.5, \"Complete\",IF(SUMPRODUCT($N$41:DP$41,$N35:DP35)<0.5, \"To start\", \"Running\")))","v":"Undefined"},0,0,{"$f":"IF(ISBLANK($I35), \"Undefined\", IF(DS35<0.5, \"Complete\",IF(SUMPRODUCT($N$41:DS$41,$N35:DS35)<0.5, \"To start\", \"Running\")))","v":"Undefined"},0,0,{"$f":"IF(ISBLANK($I35), \"Undefined\", IF(DV35<0.5, \"Complete\",IF(SUMPRODUCT($N$41:DV$41,$N35:DV35)<0.5, \"To start\", \"Running\")))","v":"Undefined"},0,0,{"$f":"IF(ISBLANK($I35), \"Undefined\", IF(DY35<0.5, \"Complete\",IF(SUMPRODUCT($N$41:DY$41,$N35:DY35)<0.5, \"To start\", \"Running\")))","v":"Undefined"},0,0,{"$f":"IF(ISBLANK($I35), \"Undefined\", IF(EB35<0.5, \"Complete\",IF(SUMPRODUCT($N$41:EB$41,$N35:EB35)<0.5, \"To start\", \"Running\")))","v":"Undefined"},null,{"$f":"SUMPRODUCT($L$41:DK$41,$L35:DK35)","v":0},0,{"$f":"OFFSET($O35,0,(Capacity!$F$2-SprintStart)*3,1,1)","v":0},0,0,0,"",0,0]
[{"$nulls":10},{"$f":"IF(SprintStart>Capacity!$F$2, \"To start\", INDEX(Burndown,ROW(K36)-ROW(K$6),MIN(Capacity!$F$2-SprintStart,29)*3+3))","v":"Undefined"},null,0,0,0,{"$f":"IF(ISBLANK($I36), \"Undefined\", IF(O36<0.5, \"Complete\",IF(SUMPRODUCT($N$41:O$41,$N36:O36)<0.5, \"To start\", \"Running\")))","v":"Undefined"},0,0,{"$f":"IF(ISBLANK($I36), \"Undefined\", IF(R36<0.5, \"Complete\",IF(SUMPRODUCT($N$41:R$41,$N36:R36)<0.5, \"To start\", \"Running\")))","v":"Undefined"},0,0,{"$f":"IF(ISBLANK($I36), \"Undefined\", IF(U36<0.5, \"Complete\",IF(SUMPRODUCT($N$41:U$41,$N36:U36)<0.5, \"To start\", \"Running\")))","v":"Undefined"},0,0,{"$f":"IF(ISBLANK($I36), \"Undefined\", IF(X36<0.5, \"Complete\",IF(SUMPRODUCT($N$41:X$41,$N36:X36)<0.5, \"To start\", \"Running\")))","v":"Undefined"},0,0,{"$f":"IF(ISBLANK($I36), \"Undefined\", IF(AA36<0.5, \"Complete\",IF(SUMPRODUCT($N$41:AA$41,$N36:AA36)<0.5, \"To start\", \"Running\")))","v":"Undefined"},0,0,{"$f":"IF(ISBLANK($I36), \"Undefined\", IF(AD36<0.5, \"Complete\",IF(SUMPRODUCT($N$41:AD$41,$N36:AD36)<0.5, \"To start\", \"Running\")))","v":"Undefined"},0,0,{"$f":"IF(ISBLANK($I36), \"Undefined\", IF(AG36<0.5, \"Complete\",IF(SUMPRODUCT($N$41:AG$41,$N36:AG36)<0.5, \"To start\", \"Running\")))","v":"Undefined"},0,0,{"$f":"IF(ISBLANK($I36), \"Undefined\", IF(AJ36<0.5, \"Complete\",IF(SUMPRODUCT($N$41:AJ$41,$N36:AJ36)<0.5, \"To start\", \"Running\")))","v":"Undefined"},0,0,{"$f":"IF(ISBLANK($I36), \"Undefined\", IF(AM36<0.5, \"Complete\",IF(SUMPRODUCT($N$41:AM$41,$N36:AM36)<0.5, \"To start\", \"Running\")))","v":"Undefined"},0,0,{"$f":"IF(ISBLANK($I36), \"Undefined\", IF(AP36<0.5, \"Complete\",IF(SUMPRODUCT($N$41:AP$41,$N36:AP36)<0.5, \"To start\", \"Running\")))","v":"Undefined"},0,0,{"$f":"IF(ISBLANK($I36), \"Undefined\", IF(AS36<0.5, \"Complete\",IF(SUMPRODUCT($N$41:AS$41,$N36:AS36)<0.5, \"To start\", \"Running\")))","v":"Undefined"},0,0,{"$f":"IF(ISBLANK($I36), \"Undefined\", IF(AV36<0.5, \"Complete\",IF(SUMPRODUCT($N$41:AV$41,$N36:AV36)<0.5, \"To start\", \"Running\")))","v":"Undefined"},0,0,{"$f":"IF(ISBLANK($I36), \"Undefined\", IF(AY36<0.5, \"Complete\",IF(SUMPRODUCT($N$41:AY$41,$N36:AY36)<0.5, \"To start\", \"Running\")))","v":"Undefined"},0,0,{"$f":"IF(ISBLANK($I36), \"Undefined\", IF(BB36<0.5, \"Complete\",IF(SUMPRODUCT($N$41:BB$41,$N36:BB36)<0.5, \"To start\", \"Running\")))","v":"Undefined"},0,0,{"$f":"IF(ISBLANK($I36), \"Undefined\", IF(BE36<0.5, \"Complete\",IF(SUMPRODUCT($N$41:BE$41,$N36:BE36)<0.5, \"To start\", \"Running\")))","v":"Undefined"},0,0,{"$f":"IF(ISBLANK($I36), \"Undefined\", IF(BH36<0.5, \"Complete\",IF(SUMPRODUCT($N$41:BH$41,$N36:BH36)<0.5, \"To start\", \"Running\")))","v":"Undefined"},0,0,{"$f":"IF(ISBLANK($I36), \"Undefined\", IF(BK36<0.5, \"Complete\",IF(SUMPRODUCT($N$41:BK$41,$N36:BK36)<0.5, \"To start\", \"Running\")))","v":"Undefined"},0,0,{"$f":"IF(ISBLANK($I36), \"Undefined\", IF(BN36<0.5, \"Complete\",IF(SUMPRODUCT($N$41:BN$41,$N36:BN36)<0.5, \"To start\", \"Running\")))","v":"Undefined"},0,0,{"$f":"IF(ISBLANK($I36), \"Undefined\", IF(BQ36<0.5, \"Complete\",IF(SUMPRODUCT($N$41:BQ$41,$N36:BQ36)<0.5, \"To start\", \"Running\")))","v":"Undefined"},0,0,{"$f":"IF(ISBLANK($I36), \"Undefined\", IF(BT36<0.5, \"Complete\",IF(SUMPRODUCT($N$41:BT$41,$N36:BT36)<0.5, \"To start\", \"Running\")))","v":"Undefined"},0,0,{"$f":"IF(ISBLANK($I36), \"Undefined\", IF(BW36<0.5, \"Complete\",IF(SUMPRODUCT($N$41:BW$41,$N36:BW36)<0.5, \"To start\", \"Running\")))","v":"Undefined"},0,0,{"$f":"IF(ISBLANK($I36), \"Undefined\", IF(BZ36<0.5, \"Complete\",IF(SUMPRODUCT($N$41:BZ$41,$N36:BZ36)<0.5, \"To start\", \"Running\")))","v":"Undefined"},0,0,{"$f":"IF(ISBLANK($I36), \"Undefined\", IF(CC36<0.5, \"Complete\",IF(SUMPRODUCT($N$41:CC$41,$N36:CC36)<0.5, \"To start\", \"Running\")))","v":"Undefined"},0,0,{"$f":"IF(ISBLANK($I36), \"Undefined\", IF(CF36<0.5, \"Complete\",IF(SUMPRODUCT($N$41:CF$41,$N36:CF36)<0.5, \"To start\", \"Running\")))","v":"Undefined"},0,0,{"$f":"IF(ISBLANK($I36), \"Undefined\", IF(CI36<0.5, \"Complete\",IF(SUMPRODUCT($N$41:CI$41,$N36:CI36)<0.5, \"To start\", \"Running\")))","v":"Undefined"},0,0,{"$f":"IF(ISBLANK($I36), \"Undefined\", IF(CL36<0.5, \"Complete\",IF(SUMPRODUCT($N$41:CL$41,$N36:CL36)<0.5, \"To start\", \"Running\")))","v":"Undefined"},0,0,{"$f":"IF(ISBLANK($I36), \"Undefined\", IF(CO36<0.5, \"Complete\",IF(SUMPRODUCT($N$41:CO$41,$N36:CO36)<0.5, \"To start\", \"Running\")))","v":"Undefined"},0,0,{"$f":"IF(ISBLANK($I36), \"Undefined\", IF(CR36<0.5, \"Complete\",IF(SUMPRODUCT($N$41:CR$41,$N36:CR36)<0.5, \"To start\", \"Running\")))","v":"Undefined"},0,0,{"$f":"IF(ISBLANK($I36), \"Undefined\", IF(CU36<0.5, \"Complete\",IF(SUMPRODUCT($N$41:CU$41,$N36:CU36)<0.5, \"To start\", \"Running\")))","v":"Undefined"},0,0,{"$f":"IF(ISBLANK($I36), \"Undefined\", IF(CX36<0.5, \"Complete\",IF(SUMPRODUCT($N$41:CX$41,$N36:CX36)<0.5, \"To start\", \"Running\")))","v":"Undefined"},0,0,{"$f":"IF(ISBLANK($I36), \"Undefined\", IF(DA36<0.5, \"Complete\",IF(SUMPRODUCT($N$41:DA$41,$N36:DA36)<0.5, \"To start\", \"Running\")))","v":"Undefined"},0,0,{"$f":"IF(ISBLANK($I36), \"Undefined\", IF(DD36<0.5, \"Complete\",IF(SUMPRODUCT($N$41:DD$41,$N36:DD36)<0.5, \"To start\", \"Running\")))","v":"Undefined"},0,0,{"$f":"IF(ISBLANK($I36), \"Undefined\", IF(DG36<0.5, \"Complete\",IF(SUMPRODUCT($N$41:DG$41,$N36:DG36)<0.5, \"To start\", \"Running\")))","v":"Undefined"},0,0,{"$f":"IF(ISBLANK($I36), \"Undefined\", IF(DJ36<0.5, \"Complete\",IF(SUMPRODUCT($N$41:DJ$41,$N36:DJ36)<0.5, \"To start\", \"Running\")))","v":"Undefined"},0,0,{"$f":"IF(ISBLANK($I36), \"Undefined\", IF(DM36<0.5, \"Complete\",IF(SUMPRODUCT($N$41:DM$41,$N36:DM36)<0.5, \"To start\", \"Running\")))","v":"Undefined"},0,0,{"$f":"IF(ISBLANK($I36), \"Undefined\", IF(DP36<0.5, \"Complete\",IF(SUMPRODUCT($N$41:DP$41,$N36:DP36)<0.5, \"To start\", \"Running\")))","v":"Undefined"},0,0,{"$f":"IF(ISBLANK($I36), \"Undefined\", IF(DS36<0.5, \"Complete\",IF(SUMPRODUCT($N$41:DS$41,$N36:DS36)<0.5, \"To start\", \"Running\")))","v":"Undefined"},0,0,{"$f":"IF(ISBLANK($I36), \"Undefined\", IF(DV36<0.5, \"Complete\",IF(SUMPRODUCT($N$41:DV$41,$N36:DV36)<0.5, \"To start\", \"Running\")))","v":"Undefined"},0,0,{"$f":"IF(ISBLANK($I36), \"Undefined\", IF(DY36<0.5, \"Complete\",IF(SUMPRODUCT($N$41:DY$41,$N36:DY36)<0.5, \"To start\", \"Running\")))","v":"Undefined"},0,0,{"$f":"IF(ISBLANK($I36), \"Undefined\", IF(EB36<0.5, \"Complete\",IF(SUMPRODUCT($N$41:EB$41,$N36:EB36)<0.5, \"To start\", \"Running\")))","v":"Undefined"},null,{"$f":"SUMPRODUCT($L$41:DK$41,$L36:DK36)","v":0},0,{"$f":"OFFSET($O36,0,(Capacity!$F$2-SprintStart)*3,1,1)","v":0},0,0,0,"",0,0]
[{"$nulls":10},{"$f":"IF(SprintStart>Capacity!$F$2, \"To start\", INDEX(Burndown,ROW(K37)-ROW(K$6),MIN(Capacity!$F$2-SprintStart,29)*3+3))","v":"Undefined"},null,0,0,0,{"$f":"IF(ISBLANK($I37), \"Undefined\", IF(O37<0.5, \"Complete\",IF(SUMPRODUCT($N$41:O$41,$N37:O37)<0.5, \"To start\", \"Running\")))","v":"Undefined"},0,0,{"$f":"IF(ISBLANK($I37), \"Undefined\", IF(R37<0.5, \"Complete\",IF(SUMPRODUCT($N$41:R$41,$N37:R37)<0.5, \"To start\", \"Running\")))","v":"Undefined"},0,0,{"$f":"IF(ISBLANK($I37), \"Undefined\", IF(U37<0.5, \"Complete\",IF(SUMPRODUCT($N$41:U$41,$N37:U37)<0.5, \"To start\", \"Running\")))","v":"Undefined"},0,0,{"$f":"IF(ISBLANK($I37), \"Undefined\", IF(X37<0.5, \"Complete\",IF(SUMPRODUCT($N$41:X$41,$N37:X37)<0.5, \"To start\", \"Running\")))","v":"Undefined"},0,0,{"$f":"IF(ISBLANK($I37), \"Undefined\", IF(AA37<0.5, \"Complete\",IF(SUMPRODUCT($N$41:AA$41,$N37:AA37)<0.5, \"To start\", \"Running\")))","v":"Undefined"},0,0,{"$f":"IF(ISBLANK($I37), \"Undefined\", IF(AD37<0.5, \"Complete\",IF(SUMPRODUCT($N$41:AD$41,$N37:AD37)<0.5, \"To start\", \"Running\")))","v":"Undefined"},0,0,{"$f":"IF(ISBLANK($I37), \"Undefined\", IF(AG37<0.5, \"Complete\",IF(SUMPRODUCT($N$41:AG$41,$N37:AG37)<0.5, \"To start\", \"Running\")))","v":"Undefined"},0,0,{"$f":"IF(ISBLANK($I37), \"Undefined\", IF(AJ37<0.5, \"Complete\",IF(SUMPRODUCT($N$41:AJ$41,$N37:AJ37)<0.5, \"To start\", \"Running\")))","v":"Undefined"},0,0,{"$f":"IF(ISBLANK($I37), \"Undefined\", IF(AM37<0.5, \"Complete\",IF(SUMPRODUCT($N$41:AM$41,$N37:AM37)<0.5, \"To start\", \"Running\")))","v":"Undefined"},0,0,{"$f":"IF(ISBLANK($I37), \"Undefined\", IF(AP37<0.5, \"Complete\",IF(SUMPRODUCT($N$41:AP$41,$N37:AP37)<0.5, \"To start\", \"Running\")))","v":"Undefined"},0,0,{"$f":"IF(ISBLANK($I37), \"Undefined\", IF(AS37<0.5, \"Complete\",IF(SUMPRODUCT($N$41:AS$41,$N37:AS37)<0.5, \"To start\", \"Running\")))","v":"Undefined"},0,0,{"$f":"IF(ISBLANK($I37), \"Undefined\", IF(AV37<0.5, \"Complete\",IF(SUMPRODUCT($N$41:AV$41,$N37:AV37)<0.5, \"To start\", \"Running\")))","v":"Undefined"},0,0,{"$f":"IF(ISBLANK($I37), \"Undefined\", IF(AY37<0.5, \"Complete\",IF(SUMPRODUCT($N$41:AY$41,$N37:AY37)<0.5, \"To start\", \"Running\")))","v":"Undefined"},0,0,{"$f":"IF(ISBLANK($I37), \"Undefined\", IF(BB37<0.5, \"Complete\",IF(SUMPRODUCT($N$41:BB$41,$N37:BB37)<0.5, \"To start\", \"Running\")))","v":"Undefined"},0,0,{"$f":"IF(ISBLANK($I37), \"Undefined\", IF(BE37<0.5, \"Complete\",IF(SUMPRODUCT($N$41:BE$41,$N37:BE37)<0.5, \"To start\", \"Running\")))","v":"Undefined"},0,0,{"$f":"IF(ISBLANK($I37), \"Undefined\", IF(BH37<0.5, \"Complete\",IF(SUMPRODUCT($N$41:BH$41,$N37:BH37)<0.5, \"To start\", \"Running\")))","v":"Undefined"},0,0,{"$f":"IF(ISBLANK($I37), \"Undefined\", IF(BK37<0.5, \"Complete\",IF(SUMPRODUCT($N$41:BK$41,$N37:BK37)<0.5, \"To start\", \"Running\")))","v":"Undefined"},0,0,{"$f":"IF(ISBLANK($I37), \"Undefined\", IF(BN37<0.5, \"Complete\",IF(SUMPRODUCT($N$41:BN$41,$N37:BN37)<0.5, \"To start\", \"Running\")))","v":"Undefined"},0,0,{"$f":"IF(ISBLANK($I37), \"Undefined\", IF(BQ37<0.5, \"Complete\",IF(SUMPRODUCT($N$41:BQ$41,$N37:BQ37)<0.5, \"To start\", \"Running\")))","v":"Undefined"},0,0,{"$f":"IF(ISBLANK($I37), \"Undefined\", IF(BT37<0.5, \"Complete\",IF(SUMPRODUCT($N$41:BT$41,$N37:BT37)<0.5, \"To start\", \"Running\")))","v":"Undefined"},0,0,{"$f":"IF(ISBLANK($I37), \"Undefined\", IF(BW37<0.5, \"Complete\",IF(SUMPRODUCT($N$41:BW$41,$N37:BW37)<0.5, \"To start\", \"Running\")))","v":"Undefined"},0,0,{"$f":"IF(ISBLANK($I37), \"Undefined\", IF(BZ37<0.5, \"Complete\",IF(SUMPRODUCT($N$41:BZ$41,$N37:BZ37)<0.5, \"To start\", \"Running\")))","v":"Undefined"},0,0,{"$f":"IF(ISBLANK($I37), \"Undefined\", IF(CC37<0.5, \"Complete\",IF(SUMPRODUCT($N$41:CC$41,$N37:CC37)<0.5, \"To start\", \"Running\")))","v":"Undefined"},0,0,{"$f":"IF(ISBLANK($I37), \"Undefined\", IF(CF37<0.5, \"Complete\",IF(SUMPRODUCT($N$41:CF$41,$N37:CF37)<0.5, \"To start\", \"Running\")))","v":"Undefined"},0,0,{"$f":"IF(ISBLANK($I37), \"Undefined\", IF(CI37<0.5, \"Complete\",IF(SUMPRODUCT($N$41:CI$41,$N37:CI37)<0.5, \"To start\", \"Running\")))","v":"Undefined"},0,0,{"$f":"IF(ISBLANK($I37), \"Undefined\", IF(CL37<0.5, \"Complete\",IF(SUMPRODUCT($N$41:CL$41,$N37:CL37)<0.5, \"To start\", \"Running\")))","v":"Undefined"},0,0,{"$f":"IF(ISBLANK($I37), \"Undefined\", IF(CO37<0.5, \"Complete\",IF(SUMPRODUCT($N$41:CO$41,$N37:CO37)<0.5, \"To start\", \"Running\")))","v":"Undefined"},0,0,{"$f":"IF(ISBLANK($I37), \"Undefined\", IF(CR37<0.5, \"Complete\",IF(SUMPRODUCT($N$41:CR$41,$N37:CR37)<0.5, \"To start\", \"Running\")))","v":"Undefined"},0,0,{"$f":"IF(ISBLANK($I37), \"Undefined\", IF(CU37<0.5, \"Complete\",IF(SUMPRODUCT($N$41:CU$41,$N37:CU37)<0.5, \"To start\", \"Running\")))","v":"Undefined"},0,0,{"$f":"IF(ISBLANK($I37), \"Undefined\", IF(CX37<0.5, \"Complete\",IF(SUMPRODUCT($N$41:CX$41,$N37:CX37)<0.5, \"To start\", \"Running\")))","v":"Undefined"},0,0,{"$f":"IF(ISBLANK($I37), \"Undefined\", IF(DA37<0.5, \"Complete\",IF(SUMPRODUCT($N$41:DA$41,$N37:DA37)<0.5, \"To start\", \"Running\")))","v":"Undefined"},0,0,{"$f":"IF(ISBLANK($I37), \"Undefined\", IF(DD37<0.5, \"Complete\",IF(SUMPRODUCT($N$41:DD$41,$N37:DD37)<0.5, \"To start\", \"Running\")))","v":"Undefined"},0,0,{"$f":"IF(ISBLANK($I37), \"Undefined\", IF(DG37<0.5, \"Complete\",IF(SUMPRODUCT($N$41:DG$41,$N37:DG37)<0.5, \"To start\", \"Running\")))","v":"Undefined"},0,0,{"$f":"IF(ISBLANK($I37), \"Undefined\", IF(DJ37<0.5, \"Complete\",IF(SUMPRODUCT($N$41:DJ$41,$N37:DJ37)<0.5, \"To start\", \"Running\")))","v":"Undefined"},0,0,{"$f":"IF(ISBLANK($I37), \"Undefined\", IF(DM37<0.5, \"Complete\",IF(SUMPRODUCT($N$41:DM$41,$N37:DM37)<0.5, \"To start\", \"Running\")))","v":"Undefined"},0,0,{"$f":"IF(ISBLANK($I37), \"Undefined\", IF(DP37<0.5, \"Complete\",IF(SUMPRODUCT($N$41:DP$41,$N37:DP37)<0.5, \"To start\", \"Running\")))","v":"Undefined"},0,0,{"$f":"IF(ISBLANK($I37), \"Undefined\", IF(DS37<0.5, \"Complete\",IF(SUMPRODUCT($N$41:DS$41,$N37:DS37)<0.5, \"To start\", \"Running\")))","v":"Undefined"},0,0,{"$f":"IF(ISBLANK($I37), \"Undefined\", IF(DV37<0.5, \"Complete\",IF(SUMPRODUCT($N$41:DV$41,$N37:DV37)<0.5, \"To start\", \"Running\")))","v":"Undefined"},0,0,{"$f":"IF(ISBLANK($I37), \"Undefined\", IF(DY37<0.5, \"Complete\",IF(SUMPRODUCT($N$41:DY$41,$N37:DY37)<0.5, \"To start\", \"Running\")))","v":"Undefined"},0,0,{"$f":"IF(ISBLANK($I37), \"Undefined\", IF(EB37<0.5, \"Complete\",IF(SUMPRODUCT($N$41:EB$41,$N37:EB37)<0.5, \"To start\", \"Running\")))","v":"Undefined"},null,{"$f":"SUMPRODUCT($L$41:DK$41,$L37:DK37)","v":0},0,{"$f":"OFFSET($O37,0,(Capacity!$F$2-SprintStart)*3,1,1)","v":0},0,0,0,"",0,0]
[{"$nulls":10},{"$f":"IF(SprintStart>Capacity!$F$2, \"To start\", INDEX(Burndown,ROW(K38)-ROW(K$6),MIN(Capacity!$F$2-SprintStart,29)*3+3))","v":"Undefined"},null,0,0,0,{"$f":"IF(ISBLANK($I38), \"Undefined\", IF(O38<0.5, \"Complete\",IF(SUMPRODUCT($N$41:O$41,$N38:O38)<0.5, \"To start\", \"Running\")))","v":"Undefined"},0,0,{"$f":"IF(ISBLANK($I38), \"Undefined\", IF(R38<0.5, \"Complete\",IF(SUMPRODUCT($N$41:R$41,$N38:R38)<0.5, \"To start\", \"Running\")))","v":"Undefined"},0,0,{"$f":"IF(ISBLANK($I38), \"Undefined\", IF(U38<0.5, \"Complete\",IF(SUMPRODUCT($N$41:U$41,$N38:U38)<0.5, \"To start\", \"Running\")))","v":"Undefined"},0,0,{"$f":"IF(ISBLANK($I38), \"Undefined\", IF(X38<0.5, \"Complete\",IF(SUMPRODUCT($N$41:X$41,$N38:X38)<0.5, \"To start\", \"Running\")))","v":"Undefined"},0,0,{"$f":"IF(ISBLANK($I38), \"Undefined\", IF(AA38<0.5, \"Complete\",IF(SUMPRODUCT($N$41:AA$41,$N38:AA38)<0.5, \"To start\", \"Running\")))","v":"Undefined"},0,0,{"$f":"IF(ISBLANK($I38), \"Undefined\", IF(AD38<0.5, \"Complete\",IF(SUMPRODUCT($N$41:AD$41,$N38:AD38)<0.5, \"To start\", \"Running\")))","v":"Undefined"},0,0,{"$f":"IF(ISBLANK($I38), \"Undefined\", IF(AG38<0.5, \"Complete\",IF(SUMPRODUCT($N$41:AG$41,$N38:AG38)<0.5, \"To start\", \"Running\")))","v":"Undefined"},0,0,{"$f":"IF(ISBLANK($I38), \"Undefined\", IF(AJ38<0.5, \"Complete\",IF(SUMPRODUCT($N$41:AJ$41,$N38:AJ38)<0.5, \"To start\", \"Running\")))","v":"Undefined"},0,0,{"$f":"IF(ISBLANK($I38), \"Undefined\", IF(AM38<0.5, \"Complete\",IF(SUMPRODUCT($N$41:AM$41,$N38:AM38)<0.5, \"To start\", \"Running\")))","v":"Undefined"},0,0,{"$f":"IF(ISBLANK($I38), \"Undefined\", IF(AP38<0.5, \"Complete\",IF(SUMPRODUCT($N$41:AP$41,$N38:AP38)<0.5, \"To start\", \"Running\")))","v":"Undefined"},0,0,{"$f":"IF(ISBLANK($I38), \"Undefined\", IF(AS38<0.5, \"Complete\",IF(SUMPRODUCT($N$41:AS$41,$N38:AS38)<0.5, \"To start\", \"Running\")))","v":"Undefined"},0,0,{"$f":"IF(ISBLANK($I38), \"Undefined\", IF(AV38<0.5, \"Complete\",IF(SUMPRODUCT($N$41:AV$41,$N38:AV38)<0.5, \"To start\", \"Running\")))","v":"Undefined"},0,0,{"$f":"IF(ISBLANK($I38), \"Undefined\", IF(AY38<0.5, \"Complete\",IF(SUMPRODUCT($N$41:AY$41,$N38:AY38)<0.5, \"To start\", \"Running\")))","v":"Undefined"},0,0,{"$f":"IF(ISBLANK($I38), \"Undefined\", IF(BB38<0.5, \"Complete\",IF(SUMPRODUCT($N$41:BB$41,$N38:BB38)<0.5, \"To start\", \"Running\")))","v":"Undefined"},0,0,{"$f":"IF(ISBLANK($I38), \"Undefined\", IF(BE38<0.5, \"Complete\",IF(SUMPRODUCT($N$41:BE$41,$N38:BE38)<0.5, \"To start\", \"Running\")))","v":"Undefined"},0,0,{"$f":"IF(ISBLANK($I38), \"Undefined\", IF(BH38<0.5, \"Complete\",IF(SUMPRODUCT($N$41:BH$41,$N38:BH38)<0.5, \"To start\", \"Running\")))","v":"Undefined"},0,0,{"$f":"IF(ISBLANK($I38), \"Undefined\", IF(BK38<0.5, \"Complete\",IF(SUMPRODUCT($N$41:BK$41,$N38:BK38)<0.5, \"To start\", \"Running\")))","v":"Undefined"},0,0,{"$f":"IF(ISBLANK($I38), \"Undefined\", IF(BN38<0.5, \"Complete\",IF(SUMPRODUCT($N$41:BN$41,$N38:BN38)<0.5, \"To start\", \"Running\")))","v":"Undefined"},0,0,{"$f":"IF(ISBLANK($I38), \"Undefined\", IF(BQ38<0.5, \"Complete\",IF(SUMPRODUCT($N$41:BQ$41,$N38:BQ38)<0.5, \"To start\", \"Running\")))","v":"Undefined"},0,0,{"$f":"IF(ISBLANK($I38), \"Undefined\", IF(BT38<0.5, \"Complete\",IF(SUMPRODUCT($N$41:BT$41,$N38:BT38)<0.5, \"To start\", \"Running\")))","v":"Undefined"},0,0,{"$f":"IF(ISBLANK($I38), \"Undefined\", IF(BW38<0.5, \"Complete\",IF(SUMPRODUCT($N$41:BW$41,$N38:BW38)<0.5, \"To start\", \"Running\")))","v":"Undefined"},0,0,{"$f":"IF(ISBLANK($I38), \"Undefined\", IF(BZ38<0.5, \"Complete\",IF(SUMPRODUCT($N$41:BZ$41,$N38:BZ38)<0.5, \"To start\", \"Running\")))","v":"Undefined"},0,0,{"$f":"IF(ISBLANK($I38), \"Undefined\", IF(CC38<0.5, \"Complete\",IF(SUMPRODUCT($N$41:CC$41,$N38:CC38)<0.5, \"To start\", \"Running\")))","v":"Undefined"},0,0,{"$f":"IF(ISBLANK($I38), \"Undefined\", IF(CF38<0.5, \"Complete\",IF(SUMPRODUCT($N$41:CF$41,$N38:CF38)<0.5, \"To start\", \"Running\")))","v":"Undefined"},0,0,{"$f":"IF(ISBLANK($I38), \"Undefined\", IF(CI38<0.5, \"Complete\",IF(SUMPRODUCT($N$41:CI$41,$N38:CI38)<0.5, \"To start\", \"Running\")))","v":"Undefined"},0,0,{"$f":"IF(ISBLANK($I38), \"Undefined\", IF(CL38<0.5, \"Complete\",IF(SUMPRODUCT($N$41:CL$41,$N38:CL38)<0.5, \"To start\", \"Running\")))","v":"Undefined"},0,0,{"$f":"IF(ISBLANK($I38), \"Undefined\", IF(CO38<0.5, \"Complete\",IF(SUMPRODUCT($N$41:CO$41,$N38:CO38)<0.5, \"To start\", \"Running\")))","v":"Undefined"},0,0,{"$f":"IF(ISBLANK($I38), \"Undefined\", IF(CR38<0.5, \"Complete\",IF(SUMPRODUCT($N$41:CR$41,$N38:CR38)<0.5, \"To start\", \"Running\")))","v":"Undefined"},0,0,{"$f":"IF(ISBLANK($I38), \"Undefined\", IF(CU38<0.5, \"Complete\",IF(SUMPRODUCT($N$41:CU$41,$N38:CU38)<0.5, \"To start\", \"Running\")))","v":"Undefined"},0,0,{"$f":"IF(ISBLANK($I38), \"Undefined\", IF(CX38<0.5, \"Complete\",IF(SUMPRODUCT($N$41:CX$41,$N38:CX38)<0.5, \"To start\", \"Running\")))","v":"Undefined"},0,0,{"$f":"IF(ISBLANK($I38), \"Undefined\", IF(DA38<0.5, \"Complete\",IF(SUMPRODUCT($N$41:DA$41,$N38:DA38)<0.5, \"To start\", \"Running\")))","v":"Undefined"},0,0,{"$f":"IF(ISBLANK($I38), \"Undefined\", IF(DD38<0.5, \"Complete\",IF(SUMPRODUCT($N$41:DD$41,$N38:DD38)<0.5, \"To start\", \"Running\")))","v":"Undefined"},0,0,{"$f":"IF(ISBLANK($I38), \"Undefined\", IF(DG38<0.5, \"Complete\",IF(SUMPRODUCT($N$41:DG$41,$N38:DG38)<0.5, \"To start\", \"Running\")))","v":"Undefined"},0,0,{"$f":"IF(ISBLANK($I38), \"Undefined\", IF(DJ38<0.5, \"Complete\",IF(SUMPRODUCT($N$41:DJ$41,$N38:DJ38)<0.5, \"To start\", \"Running\")))","v":"Undefined"},0,0,{"$f":"IF(ISBLANK($I38), \"Undefined\", IF(DM38<0.5, \"Complete\",IF(SUMPRODUCT($N$41:DM$41,$N38:DM38)<0.5, \"To start\", \"Running\")))","v":"Undefined"},0,0,{"$f":"IF(ISBLANK($I38), \"Undefined\", IF(DP38<0.5, \"Complete\",IF(SUMPRODUCT($N$41:DP$41,$N38:DP38)<0.5, \"To start\", \"Running\")))","v":"Undefined"},0,0,{"$f":"IF(ISBLANK($I38), \"Undefined\", IF(DS38<0.5, \"Complete\",IF(SUMPRODUCT($N$41:DS$41,$N38:DS38)<0.5, \"To start\", \"Running\")))","v":"Undefined"},0,0,{"$f":"IF(ISBLANK($I38), \"Undefined\", IF(DV38<0.5, \"Complete\",IF(SUMPRODUCT($N$41:DV$41,$N38:DV38)<0.5, \"To start\", \"Running\")))","v":"Undefined"},0,0,{"$f":"IF(ISBLANK($I38), \"Undefined\", IF(DY38<0.5, \"Complete\",IF(SUMPRODUCT($N$41:DY$41,$N38:DY38)<0.5, \"To start\", \"Running\")))","v":"Undefined"},0,0,{"$f":"IF(ISBLANK($I38), \"Undefined\", IF(EB38<0.5, \"Complete\",IF(SUMPRODUCT($N$41:EB$41,$N38:EB38)<0.5, \"To start\", \"Running\")))","v":"Undefined"},null,{"$f":"SUMPRODUCT($L$41:DK$41,$L38:DK38)","v":0},0,{"$f":"OFFSET($O38,0,(Capacity!$F$2-SprintStart)*3,1,1)","v":0},0,0,0,"",0,0]
[{"$nulls":10},{"$f":"IF(SprintStart>Capacity!$F$2, \"To start\", INDEX(Burndown,ROW(K39)-ROW(K$6),MIN(Capacity!$F$2-SprintStart,29)*3+3))","v":"Undefined"},null,0,0,0,{"$f":"IF(ISBLANK($I39), \"Undefined\", IF(O39<0.5, \"Complete\",IF(SUMPRODUCT($N$41:O$41,$N39:O39)<0.5, \"To start\", \"Running\")))","v":"Undefined"},0,0,{"$f":"IF(ISBLANK($I39), \"Undefined\", IF(R39<0.5, \"Complete\",IF(SUMPRODUCT($N$41:R$41,$N39:R39)<0.5, \"To start\", \"Running\")))","v":"Undefined"},0,0,{"$f":"IF(ISBLANK($I39), \"Undefined\", IF(U39<0.5, \"Complete\",IF(SUMPRODUCT($N$41:U$41,$N39:U39)<0.5, \"To start\", \"Running\")))","v":"Undefined"},0,0,{"$f":"IF(ISBLANK($I39), \"Undefined\", IF(X39<0.5, \"Complete\",IF(SUMPRODUCT($N$41:X$41,$N39:X39)<0.5, \"To start\", \"Running\")))","v":"Undefined"},0,0,{"$f":"IF(ISBLANK($I39), \"Undefined\", IF(AA39<0.5, \"Complete\",IF(SUMPRODUCT($N$41:AA$41,$N39:AA39)<0.5, \"To start\", \"Running\")))","v":"Undefined"},0,0,{"$f":"IF(ISBLANK($I39), \"Undefined\", IF(AD39<0.5, \"Complete\",IF(SUMPRODUCT($N$41:AD$41,$N39:AD39)<0.5, \"To start\", \"Running\")))","v":"Undefined"},0,0,{"$f":"IF(ISBLANK($I39), \"Undefined\", IF(AG39<0.5, \"Complete\",IF(SUMPRODUCT($N$41:AG$41,$N39:AG39)<0.5, \"To start\", \"Running\")))","v":"Undefined"},0,0,{"$f":"IF(ISBLANK($I39), \"Undefined\", IF(AJ39<0.5, \"Complete\",IF(SUMPRODUCT($N$41:AJ$41,$N39:AJ39)<0.5, \"To start\", \"Running\")))","v":"Undefined"},0,0,{"$f":"IF(ISBLANK($I39), \"Undefined\", IF(AM39<0.5, \"Complete\",IF(SUMPRODUCT($N$41:AM$41,$N39:AM39)<0.5, \"To start\", \"Running\")))","v":"Undefined"},0,0,{"$f":"IF(ISBLANK($I39), \"Undefined\", IF(AP39<0.5, \"Complete\",IF(SUMPRODUCT($N$41:AP$41,$N39:AP39)<0.5, \"To start\", \"Running\")))","v":"Undefined"},0,0,{"$f":"IF(ISBLANK($I39), \"Undefined\", IF(AS39<0.5, \"Complete\",IF(SUMPRODUCT($N$41:AS$41,$N39:AS39)<0.5, \"To start\", \"Running\")))","v":"Undefined"},0,0,{"$f":"IF(ISBLANK($I39), \"Undefined\", IF(AV39<0.5, \"Complete\",IF(SUMPRODUCT($N$41:AV$41,$N39:AV39)<0.5, \"To start\", \"Running\")))","v":"Undefined"},0,0,{"$f":"IF(ISBLANK($I39), \"Undefined\", IF(AY39<0.5, \"Complete\",IF(SUMPRODUCT($N$41:AY$41,$N39:AY39)<0.5, \"To start\", \"Running\")))","v":"Undefined"},0,0,{"$f":"IF(ISBLANK($I39), \"Undefined\", IF(BB39<0.5, \"Complete\",IF(SUMPRODUCT($N$41:BB$41,$N39:BB39)<0.5, \"To start\", \"Running\")))","v":"Undefined"},0,0,{"$f":"IF(ISBLANK($I39), \"Undefined\", IF(BE39<0.5, \"Complete\",IF(SUMPRODUCT($N$41:BE$41,$N39:BE39)<0.5, \"To start\", \"Running\")))","v":"Undefined"},0,0,{"$f":"IF(ISBLANK($I39), \"Undefined\", IF(BH39<0.5, \"Complete\",IF(SUMPRODUCT($N$41:BH$41,$N39:BH39)<0.5, \"To start\", \"Running\")))","v":"Undefined"},0,0,{"$f":"IF(ISBLANK($I39), \"Undefined\", IF(BK39<0.5, \"Complete\",IF(SUMPRODUCT($N$41:BK$41,$N39:BK39)<0.5, \"To start\", \"Running\")))","v":"Undefined"},0,0,{"$f":"IF(ISBLANK($I39), \"Undefined\", IF(BN39<0.5, \"Complete\",IF(SUMPRODUCT($N$41:BN$41,$N39:BN39)<0.5, \"To start\", \"Running\")))","v":"Undefined"},0,0,{"$f":"IF(ISBLANK($I39), \"Undefined\", IF(BQ39<0.5, \"Complete\",IF(SUMPRODUCT($N$41:BQ$41,$N39:BQ39)<0.5, \"To start\", \"Running\")))","v":"Undefined"},0,0,{"$f":"IF(ISBLANK($I39), \"Undefined\", IF(BT39<0.5, \"Complete\",IF(SUMPRODUCT($N$41:BT$41,$N39:BT39)<0.5, \"To start\", \"Running\")))","v":"Undefined"},0,0,{"$f":"IF(ISBLANK($I39), \"Undefined\", IF(BW39<0.5, \"Complete\",IF(SUMPRODUCT($N$41:BW$41,$N39:BW39)<0.5, \"To start\", \"Running\")))","v":"Undefined"},0,0,{"$f":"IF(ISBLANK($I39), \"Undefined\", IF(BZ39<0.5, \"Complete\",IF(SUMPRODUCT($N$41:BZ$41,$N39:BZ39)<0.5, \"To start\", \"Running\")))","v":"Undefined"},0,0,{"$f":"IF(ISBLANK($I39), \"Undefined\", IF(CC39<0.5, \"Complete\",IF(SUMPRODUCT($N$41:CC$41,$N39:CC39)<0.5, \"To start\", \"Running\")))","v":"Undefined"},0,0,{"$f":"IF(ISBLANK($I39), \"Undefined\", IF(CF39<0.5, \"Complete\",IF(SUMPRODUCT($N$41:CF$41,$N39:CF39)<0.5, \"To start\", \"Running\")))","v":"Undefined"},0,0,{"$f":"IF(ISBLANK($I39), \"Undefined\", IF(CI39<0.5, \"Complete\",IF(SUMPRODUCT($N$41:CI$41,$N39:CI39)<0.5, \"To start\", \"Running\")))","v":"Undefined"},0,0,{"$f":"IF(ISBLANK($I39), \"Undefined\", IF(CL39<0.5, \"Complete\",IF(SUMPRODUCT($N$41:CL$41,$N39:CL39)<0.5, \"To start\", \"Running\")))","v":"Undefined"},0,0,{"$f":"IF(ISBLANK($I39), \"Undefined\", IF(CO39<0.5, \"Complete\",IF(SUMPRODUCT($N$41:CO$41,$N39:CO39)<0.5, \"To start\", \"Running\")))","v":"Undefined"},0,0,{"$f":"IF(ISBLANK($I39), \"Undefined\", IF(CR39<0.5, \"Complete\",IF(SUMPRODUCT($N$41:CR$41,$N39:CR39)<0.5, \"To start\", \"Running\")))","v":"Undefined"},0,0,{"$f":"IF(ISBLANK($I39), \"Undefined\", IF(CU39<0.5, \"Complete\",IF(SUMPRODUCT($N$41:CU$41,$N39:CU39)<0.5, \"To start\", \"Running\")))","v":"Undefined"},0,0,{"$f":"IF(ISBLANK($I39), \"Undefined\", IF(CX39<0.5, \"Complete\",IF(SUMPRODUCT($N$41:CX$41,$N39:CX39)<0.5, \"To start\", \"Running\")))","v":"Undefined"},0,0,{"$f":"IF(ISBLANK($I39), \"Undefined\", IF(DA39<0.5, \"Complete\",IF(SUMPRODUCT($N$41:DA$41,$N39:DA39)<0.5, \"To start\", \"Running\")))","v":"Undefined"},0,0,{"$f":"IF(ISBLANK($I39), \"Undefined\", IF(DD39<0.5, \"Complete\",IF(SUMPRODUCT($N$41:DD$41,$N39:DD39)<0.5, \"To start\", \"Running\")))","v":"Undefined"},0,0,{"$f":"IF(ISBLANK($I39), \"Undefined\", IF(DG39<0.5, \"Complete\",IF(SUMPRODUCT($N$41:DG$41,$N39:DG39)<0.5, \"To start\", \"Running\")))","v":"Undefined"},0,0,{"$f":"IF(ISBLANK($I39), \"Undefined\", IF(DJ39<0.5, \"Complete\",IF(SUMPRODUCT($N$41:DJ$41,$N39:DJ39)<0.5, \"To start\", \"Running\")))","v":"Undefined"},0,0,{"$f":"IF(ISBLANK($I39), \"Undefined\", IF(DM39<0.5, \"Complete\",IF(SUMPRODUCT($N$41:DM$41,$N39:DM39)<0.5, \"To start\", \"Running\")))","v":"Undefined"},0,0,{"$f":"IF(ISBLANK($I39), \"Undefined\", IF(DP39<0.5, \"Complete\",IF(SUMPRODUCT($N$41:DP$41,$N39:DP39)<0.5, \"To start\", \"Running\")))","v":"Undefined"},0,0,{"$f":"IF(ISBLANK($I39), \"Undefined\", IF(DS39<0.5, \"Complete\",IF(SUMPRODUCT($N$41:DS$41,$N39:DS39)<0.5, \"To start\", \"Running\")))","v":"Undefined"},0,0,{"$f":"IF(ISBLANK($I39), \"Undefined\", IF(DV39<0.5, \"Complete\",IF(SUMPRODUCT($N$41:DV$41,$N39:DV39)<0.5, \"To start\", \"Running\")))","v":"Undefined"},0,0,{"$f":"IF(ISBLANK($I39), \"Undefined\", IF(DY39<0.5, \"Complete\",IF(SUMPRODUCT($N$41:DY$41,$N39:DY39)<0.5, \"To start\", \"Running\")))","v":"Undefined"},0,0,{"$f":"IF(ISBLANK($I39), \"Undefined\", IF(EB39<0.5, \"Complete\",IF(SUMPRODUCT($N$41:EB$41,$N39:EB39)<0.5, \"To start\", \"Running\")))","v":"Undefined"},null,{"$f":"SUMPRODUCT($L$41:DK$41,$L39:DK39)","v":0},0,{"$f":"OFFSET($O39,0,(Capacity!$F$2-SprintStart)*3,1,1)","v":0},0,0,0,"",0,0]
[{"$nulls":13},"Day",null,1,"Day",null,{"$f":"P40+1","v":2},"Day",null,{"$f":"S40+1","v":3},"Day",null,{"$f":"V40+1","v":4},"Day",null,{"$f":"Y40+1","v":5},"Day",null,{"$f":"AB40+1","v":6},"Day",null,{"$f":"AE40+1","v":7},"Day",null,{"$f":"AH40+1","v":8},"Day",null,{"$f":"AK40+1","v":9},"Day",null,{"$f":"AN40+1","v":10},"Day",null,{"$f":"AQ40+1","v":11},"Day",null,{"$f":"AT40+1","v":12},"Day",null,{"$f":"AW40+1","v":13},"Day",null,{"$f":"AZ40+1","v":14},"Day",null,{"$f":"BC40+1","v":15},"Day",null,{"$f":"BF40+1","v":16},"Day",null,{"$f":"BI40+1","v":17},"Day",null,{"$f":"BL40+1","v":18},"Day",null,{"$f":"BO40+1","v":19},"Day",null,{"$f":"BR40+1","v":20},"Day",null,{"$f":"BU40+1","v":21},"Day",null,{"$f":"BX40+1","v":22},"Day",null,{"$f":"CA40+1","v":23},"Day",null,{"$f":"CD40+1","v":24},"Day",null,{"$f":"CG40+1","v":25},"Day",null,{"$f":"CJ40+1","v":26},"Day",null,{"$f":"CM40+1","v":27},"Day",null,{"$f":"CP40+1","v":28},"Day",null,{"$f":"CS40+1","v":29},"Day",null,{"$f":"CV40+1","v":30},"Day",null,{"$f":"CY40+1","v":31},"Day",null,{"$f":"DB40+1","v":32},"Day",null,{"$f":"DE40+1","v":33},"Day",null,{"$f":"DH40+1","v":34},"Day",null,{"$f":"DK40+1","v":35},"Day",null,{"$f":"DN40+1","v":36},"Day",null,{"$f":"DQ40+1","v":37},"Day",null,{"$f":"DT40+1","v":38},"Day",null,{"$f":"DW40+1","v":39},"Day",null,{"$f":"DZ40+1","v":40}]
[{"$nulls":8},"Time Spent Mask",{"$nulls":4},1,0,0,1,0,0,1,0,0,1,0,0,1,0,0,1,0,0,1,0,0,1,0,0,1,0,0,1,0,0,1,0,0,1,0,0,1,0,0,1,0,0,1,0,0,1,0,0,1,0,0,1,0,0,1,0,0,1,0,0,1,0,0,1,0,0,1,0,0,1,0,0,1,0,0,1,0,0,1,0,0,1,0,0,1,0,0,1,0,0,1,0,0,1,0,0,1,0,0,1,0,0,1,0,0,1,0,0,1,0,0,1,0,0,1,0,0,1,0,0]
[{"$nulls":8},"Time Left Mask",{"$nulls":4},0,1,0,0,1,0,0,1,0,0,1,0,0,1,0,0,1,0,0,1,0,0,1,0,0,1,0,0,1,0,0,1,0,0,1,0,0,1,0,0,1,0,0,1,0,0,1,0,0,1,0,0,1,0,0,1,0,0,1,0,0,1,0,0,1,0,0,1,0,0,1,0,0,1,0,0,1,0,0,1,0,0,1,0,0,1,0,0,1,0,0,1,0,0,1,0,0,1,0,0,1,0,0,1,0,0,1,0,0,1,0,0,1,0,0,1,0,0,1,0]
[{"$nulls":8},"Status Mask",{"$nulls":4},0,0,1,0,0,1,0,0,1,0,0,1,0,0,1,0,0,1,0,0,1,0,0,1,0,0,1,0,0,1,0,0,1,0,0,1,0,0,1,0,0,1,0,0,1,0,0,1,0,0,1,0,0,1,0,0,1,0,0,1,0,0,1,0,0,1,0,0,1,0,0,1,0,0,1,0,0,1,0,0,1,0,0,1,0,0,1,0,0,1,0,0,1,0,0,1,0,0,1,0,0,1,0,0,1,0,0,1,0,0,1,0,0,1,0,0,1,0,0,1]
[{"$nulls":8},"Total:",null,null,"(hours)",{"$f":"SUBTOTAL(109,M$7:M$39)","v":36},{"$f":"SUBTOTAL(109,N$7:N$39)","v":4},0,null,{"$f":"SUBTOTAL(109,Q$7:Q$39)","v":4},{"$f":"SUBTOTAL(109,R$7:R$39)","v":12},null,0,{"$f":"SUBTOTAL(109,U$7:U$39)","v":12},null,{"$f":"SUBTOTAL(109,W$7:W$39)","v":4},{"$f":"SUBTOTAL(109,X$7:X$39)","v":12},null,{"$f":"SUBTOTAL(109,Z$7:Z$39)","v":4},{"$f":"SUBTOTAL(109,AA$7:AA$39)","v":12},null,{"$f":"SUBTOTAL(109,AC$7:AC$39)","v":4},{"$f":"SUBTOTAL(109,AD$7:AD$39)","v":8},null,{"$f":"SUBTOTAL(109,AF$7:AF$39)","v":4},{"$f":"SUBTOTAL(109,AG$7:AG$39)","v":8},null,{"$f":"SUBTOTAL(109,AI$7:AI$39)","v":14},{"$f":"SUBTOTAL(109,AJ$7:AJ$39)","v":2},null,{"$f":"SUBTOTAL(109,AL$7:AL$39)","v":0},{"$f":"SUBTOTAL(109,AM$7:AM$39)","v":2},null,{"$f":"SUBTOTAL(109,AO$7:AO$39)","v":2},{"$f":"SUBTOTAL(109,AP$7:AP$39)","v":0},null,{"$f":"SUBTOTAL(109,AR$7:AR$39)","v":0},{"$f":"SUBTOTAL(109,AS$7:AS$39)","v":0},null,{"$f":"SUBTOTAL(109,AU$7:AU$39)","v":0},{"$f":"SUBTOTAL(109,AV$7:AV$39)","v":0},null,{"$f":"SUBTOTAL(109,AX$7:AX$39)","v":0},{"$f":"SUBTOTAL(109,AY$7:AY$39)","v":0},null,{"$f":"SUBTOTAL(109,BA$7:BA$39)","v":0},{"$f":"SUBTOTAL(109,BB$7:BB$39)","v":0},null,{"$f":"SUBTOTAL(109,BD$7:BD$39)","v":0},{"$f":"SUBTOTAL(109,BE$7:BE$39)","v":0},null,{"$f":"SUBTOTAL(109,BG$7:BG$39)","v":0},{"$f":"SUBTOTAL(109,BH$7:BH$39)","v":0},null,{"$f":"SUBTOTAL(109,BJ$7:BJ$39)","v":0},{"$f":"SUBTOTAL(109,BK$7:BK$39)","v":0},null,{"$f":"SUBTOTAL(109,BM$7:BM$39)","v":0},{"$f":"SUBTOTAL(109,BN$7:BN$39)","v":0},null,{"$f":"SUBTOTAL(109,BP$7:BP$39)","v":0},{"$f":"SUBTOTAL(109,BQ$7:BQ$39)","v":0},null,{"$f":"SUBTOTAL(109,BS$7:BS$39)","v":0},{"$f":"SUBTOTAL(109,BT$7:BT$39)","v":0},null,{"$f":"SUBTOTAL(109,BV$7:BV$39)","v":0},{"$f":"SUBTOTAL(109,BW$7:BW$39)","v":0},null,{"$f":"SUBTOTAL(109,BY$7:BY$39)","v":0},{"$f":"SUBTOTAL(109,BZ$7:BZ$39)","v":0},null,{"$f":"SUBTOTAL(109,CB$7:CB$39)","v":0},{"$f":"SUBTOTAL(109,CC$7:CC$39)","v":0},null,{"$f":"SUBTOTAL(109,CE$7:CE$39)","v":0},{"$f":"SUBTOTAL(109,CF$7:CF$39)","v":0},null,{"$f":"SUBTOTAL(109,CH$7:CH$39)","v":0},{"$f":"SUBTOTAL(109,CI$7:CI$39)","v":0},null,{"$f":"SUBTOTAL(109,CK$7:CK$39)","v":0},{"$f":"SUBTOTAL(109,CL$7:CL$39)","v":0},null,{"$f":"SUBTOTAL(109,CN$7:CN$39)","v":0},{"$f":"SUBTOTAL(109,CO$7:CO$39)","v":0},null,{"$f":"SUBTOTAL(109,CQ$7:CQ$39)","v":0},{"$f":"SUBTOTAL(109,CR$7:CR$39)","v":0},null,{"$f":"SUBTOTAL(109,CT$7:CT$39)","v":0},{"$f":"SUBTOTAL(109,CU$7:CU$39)","v":0},null,{"$f":"SUBTOTAL(109,CW$7:CW$39)","v":0},{"$f":"SUBTOTAL(109,CX$7:CX$39)","v":0},null,{"$f":"SUBTOTAL(109,CZ$7:CZ$39)","v":0},0,0,0,0,0,0,0,0,0,0,0,0,0,0,0,0,0,0,0,0,0,0,0,0,0,0,0,0,0,null,{"$f":"SUBTOTAL(109,EE$7:EE$39)","v":52},{"$f":"EE44/8","v":6.5},{"$f":"SUBTOTAL(109,EG$7:EG$39)","v":0},{"$f":"EG44/8","v":0},{"$f":"SUBTOTAL(109,EI$7:EI$39)","v":52},{"$f":"EI44/8","v":6.5},{"$f":"(EI44/M44)-1","v":{"v":0.4444444444444444,"d":"44%"}},{"$f":"EI44-M3","v":52},{"$f":"EL44/8","v":6.5}]
[{"$nulls":11},"(days)",{"$f":"M44/8","v":4.5},{"$f":"N44/8","v":0.5},{"$f":"O44/8","v":0},null,0.5,1.5,null,0,1.5,null,0.5,1.5,null,0.5,1.5,null,0.5,1,null,0.5,1,null,1.75,0.25,null,0,0.25,null,0.25,0,null,0,0,null,0,0,null,0,0,null,0,0,null,0,0,null,0,0,null,0,0,null,0,0,null,0,0,null,0,0,0,0,0,0,0,0,{"$f":"CA44/8","v":0},0,0,0,0,0,0,0,0,0,0,0,0,0,0,0,0,0,0,0,0,0,0,0,0,0,0,0,0,0,0,0,0,0,0,0,0,0,0,0,0,0,0,0,0,0,0,0,0,0,0,0,0,0,0]

{"sheet":"Team Roster","index":3,"n_rows":14,"n_cols":8,"rows_kept":14}
[]
[]
[]
[null,"Sprint Vision","[Sprint Vision]"]
[]
[null,"Sprint Team","Name","Initial","Phone","Mobile phone","Email","IM"]
[]
[null,null,"Team","Team"]
[null,null,"Miguel Almeida","MA"]
[null,null,"Miguel Rosa","MR"]
[null,null,"João Albuquerque","JQ"]
[]
[]
[null,null,"No one","No one"]

{"sheet":"Capacity","index":4,"n_rows":31,"n_cols":59,"rows_kept":31,"merged":[[4,1,4,8],[4,10,4,58],[5,50,5,56],[5,57,5,58],[6,50,6,55],[7,50,7,55],[8,50,8,55],[9,50,9,55],[10,50,10,55],[11,50,11,55],[12,50,12,55],[13,1,13,3],[13,50,13,55],[14,1,14,3],[14,50,14,55],[15,1,15,3],[15,50,15,55],[16,50,16,55],[17,50,17,55],[18,50,18,55],[19,50,19,55],[20,50,20,55],[21,50,21,55],[22,50,22,55],[23,50,23,55],[24,50,24,55],[25,7,25,8],[25,50,25,54],[26,7,26,8]]}
[]
[null,"Current Date",null,null,{"$f":"TEXT(F2,\"[$-en-US]ddd\")","v":"Wed"},{"$f":"TODAY()","v":"2018-05-30"}]
[null,"Sprint Start Date",null,null,{"$f":"TEXT(F3,\"[$-en-US]ddd\")","v":"Tue"},"2018-04-24"]
[]
[null,"Capacity Tracking Stats",{"$nulls":8},"Team Member Available Capacity (Hours)"]
[{"$nulls":10},{"$f":"SprintStart","v":"2018-04-24"},{"$f":"IF(AND(SkipWeekends, WEEKDAY(K6)=6),K6+3, K6+1)","v":"2018-04-25"},"2018-04-26","2018-04-27","2018-04-28","2018-04-29","2018-04-30","2018-05-01","2018-05-02","2018-05-03","2018-05-04","2018-05-05","2018-05-06","2018-05-07","2018-05-08","2018-05-09","2018-05-10","2018-05-11","2018-05-12","2018-05-13","2018-05-14","2018-05-15","2018-05-16","2018-05-17","2018-05-18","2018-05-19","2018-05-20","2018-05-21","2018-05-22","2018-05-23","2018-05-24","2018-05-25","2018-05-26","2018-05-27","2018-05-28","2018-05-29","2018-05-30","2018-05-31","2018-06-01","2018-06-02","Available Capacity",{"$nulls":6},"Available Capacity\n-Assigned Effort"]
[{"$nulls":5},"Project Team","% Allocation","Assigned\n Hours","Assigned \nDays",null,{"$f":"UPPER(LEFT(TEXT(K6,\"[$-en-US]ddd\"),1))","v":"T"},{"$f":"UPPER(LEFT(TEXT(L6,\"[$-en-US]ddd\"),1))","v":"W"},{"$f":"UPPER(LEFT(TEXT(M6,\"[$-en-US]ddd\"),1))","v":"T"},{"$f":"UPPER(LEFT(TEXT(N6,\"[$-en-US]ddd\"),1))","v":"F"},{"$f":"UPPER(LEFT(TEXT(O6,\"[$-en-US]ddd\"),1))","v":"S"},"S","M","T","W","T","F","S","S","M","T","W","T","F","S","S","M","T","W","T","F","S","S","M","T","W","T","F","S","S","M","T","W","T","F","S","Hours",{"$nulls":5},"Days","Hours","Days"]
[null,null,"Hours","Days",null,"MA",{"v":1,"d":"100%"},{"$f":"SUMIF(Sprint!$J$6:$J$1833,F8,Sprint!$EI$6:$EI$1833)","v":36},{"$f":"H8/8","v":4.5},null,8,8,8,{"$f":"IF(OR(WEEKDAY(N$6)=7,WEEKDAY(N$6)=1), \"\", 0)","v":0},{"$f":"IF(OR(WEEKDAY(O$6)=7,WEEKDAY(O$6)=1), \"\", 0)","v":""},{"$f":"IF(OR(WEEKDAY(P$6)=7,WEEKDAY(P$6)=1), \"\", 0)","v":""},{"$f":"IF(OR(WEEKDAY(Q$6)=7,WEEKDAY(Q$6)=1), \"\", 0)","v":0},8,8,8,0,null,{"$f":"IF(OR(WEEKDAY(W$6)=7,WEEKDAY(W$6)=1), \"\", 0)","v":""},0,8,8,8,0,"","",0,8,8,8,0,"","",0,0,0,0,0,"","",0,0,0,0,0,"",{"$f":"IF(F8=\"No one\",0,(SUM(K8:AX8))*G8)","v":96},{"$nulls":5},{"$f":"AY8/8","v":12},{"$f":"AY8-H8","v":{"v":60,"d":"60.0"}},{"$f":"BF8/8","v":7.5}]
[null,"Total Capacity",{"$f":"SUM(AY6:BB25)","v":{"v":116,"d":"116.0"}},{"$f":"C9/8","v":14.5},null,"C2",{"v":1,"d":"100%"},{"$f":"SUMIF(Sprint!$J$6:$J$1833,F9,Sprint!$EI$6:$EI$1833)","v":0},{"$f":"H9/8","v":0},null,8,4,8,0,"",{"$f":"IF(OR(WEEKDAY(P$6)=7,WEEKDAY(P$6)=1), \"\", 0)","v":""},0,0,0,0,0,null,"",0,0,0,0,0,"","",0,0,0,0,0,"","",0,0,0,0,0,"","",0,0,0,0,0,"",20,{"$nulls":5},{"$f":"AY9/8","v":2.5},{"$f":"AY9-H9","v":{"v":20,"d":"20.0"}},{"$f":"BF9/8","v":2.5}]
[null,"Planned Effort",{"$f":"Sprint!M44","v":{"v":36,"d":"36.0"}},{"$f":"C10/8","v":4.5},null,"C3",{"v":1,"d":"100%"},{"$f":"SUMIF(Sprint!$J$6:$J$1833,F10,Sprint!$EI$6:$EI$1833)","v":0},{"$f":"H10/8","v":0},null,0,0,0,null,"","",0,0,0,0,0,"","",0,0,0,0,0,"","",0,0,0,0,0,"","",0,0,0,0,0,"","",0,0,0,0,0,"",0,{"$nulls":5},{"$f":"AY10/8","v":0},{"v":0,"d":"0.0"},0]
[null," Total Effort (Spent + Remaining)",{"$f":"SUM(H8:H25)","v":{"v":36,"d":"36.0"}},{"$f":"C11/8","v":4.5},null,"C4",{"v":1,"d":"100%"},{"$f":"SUMIF(Sprint!$J$6:$J$1833,F11,Sprint!$EI$6:$EI$1833)","v":0},{"$f":"H11/8","v":0},null,0,0,0,null,"","",0,0,0,0,0,"","",0,0,0,0,0,"","",0,0,0,0,0,"","",0,0,0,0,0,"","",0,0,0,0,0,"",0,{"$nulls":5},0,{"v":0,"d":"0.0"},0]
[null,"Total Effort - Capacity",{"$f":"C9-C11","v":{"v":80,"d":"80.0"}},{"$f":"C12/8","v":{"v":10,"d":"10.0"}},null,"C5",{"v":1,"d":"100%"},{"$f":"SUMIF(Sprint!$J$6:$J$1833,F12,Sprint!$EI$6:$EI$1833)","v":0},{"$f":"H12/8","v":0},null,0,"H",0,{"$f":"IF(OR(WEEKDAY(N$6)=7,WEEKDAY(N$6)=1), \"\", 0)","v":0},"","",0,0,0,0,0,"","",0,0,0,0,0,"","",0,0,0,0,0,"","",0,0,0,0,0,"","",0,0,0,0,0,"",0,{"$nulls":5},0,{"v":0,"d":"0.0"},0]
[{"$nulls":7},{"$f":"SUMIF(Sprint!$J$6:$J$1833,F13,Sprint!$EI$6:$EI$1833)","v":0},0,null,0,0,0,0,"","",0,0,0,0,0,"","",0,0,0,0,0,"","",0,0,0,0,0,"","",0,0,0,0,0,"","",0,0,0,0,0,"",0,{"$nulls":5},{"$f":"AY13/8","v":0},{"v":0,"d":"0.0"},0]
[null,"ATTENTION",{"$nulls":5},{"$f":"SUMIF(Sprint!$J$6:$J$1833,F14,Sprint!$EI$6:$EI$1833)","v":0},0,null,0,0,0,0,"","",0,0,0,0,0,"","",0,0,0,0,0,"","",0,0,0,0,0,"","",0,0,0,0,0,"","",0,0,0,0,0,"",0,{"$nulls":5},0,{"v":0,"d":"0.0"},0]
[null,"The responsible must be fullfilled in  all sprint",{"$nulls":3},"Team",{"v":0,"d":"0%"},{"$f":"SUMIF(Sprint!$J$6:$J$1833,F15,Sprint!$EI$6:$EI$1833)","v":0},0,null,0,0,0,0,"","",0,0,0,0,0,"","",0,0,0,0,0,"","",0,0,0,0,0,"","",0,0,0,0,0,"","",0,0,0,0,0,"",0,{"$nulls":5},0,{"v":0,"d":"0.0"},0]
[null," tasks. Use \"No one\" instead of null.",{"$nulls":3},"No one",{"v":0,"d":"0%"},{"$f":"SUMIF(Sprint!$J$6:$J$1833,F16,Sprint!$EI$6:$EI$1833)","v":0},0,null,0,0,0,0,"","",0,{"$f":"IF(OR(WEEKDAY(R$6)=7,WEEKDAY(R$6)=1), \"\", 0)","v":0},0,0,0,"","",0,0,0,0,0,"","",0,0,0,0,0,"","",0,0,0,0,0,"","",0,0,0,0,0,"",0,{"$nulls":5},0,{"v":0,"d":"0.0"},0]
[{"$nulls":7},{"$f":"SUMIF(Sprint!$J$6:$J$1833,F17,Sprint!$EI$6:$EI$1833)","v":0},0,null,0,0,0,0,"","",0,0,0,0,0,"","",0,0,0,0,0,"","",0,0,0,0,0,"","",0,0,0,0,0,"","",0,0,0,0,0,"",0,{"$nulls":5},0,0,0]
[null,"Yellow = Under use",{"$nulls":5},{"$f":"SUMIF(Sprint!$J$6:$J$1833,F18,Sprint!$EI$6:$EI$1833)","v":0},0,null,0,0,0,0,"","",0,0,0,0,0,"","",0,0,0,0,0,"","",0,0,0,0,0,"","",0,0,0,0,0,"","",0,0,0,0,0,"",0,{"$nulls":5},0,0,0]
[null,"Red = Over use",{"$nulls":5},{"$f":"SUMIF(Sprint!$J$6:$J$1833,F19,Sprint!$EI$6:$EI$1833)","v":0},0,null,0,0,0,0,"","",0,0,0,0,0,"","",0,0,0,0,0,"","",0,0,0,0,0,"","",0,0,0,0,0,"","",0,0,0,0,0,"",0,{"$nulls":5},0,0,0]
[{"$nulls":7},{"$f":"SUMIF(Sprint!$J$6:$J$1833,F20,Sprint!$EI$6:$EI$1833)","v":0},0,null,0,0,0,0,"","",0,0,0,0,0,"","",0,0,0,0,0,"","",0,0,0,0,0,"","",0,0,0,0,0,"","",0,0,0,0,0,"",0,{"$nulls":5},0,0,0]
[{"$nulls":7},{"$f":"SUMIF(Sprint!$J$6:$J$1833,F21,Sprint!$EI$6:$EI$1833)","v":0},0,null,0,0,0,0,"","",0,0,0,0,0,"","",0,0,0,0,0,"","",0,0,0,0,0,"","",0,0,0,0,0,"","",0,0,0,0,0,"",0,{"$nulls":5},0,0,0]
[{"$nulls":7},{"$f":"SUMIF(Sprint!$J$6:$J$1833,F22,Sprint!$EI$6:$EI$1833)","v":0},0,null,0,0,0,0,"","",0,0,0,0,0,"","",0,0,0,0,0,"","",0,0,0,0,0,"","",0,0,0,0,0,"","",0,0,0,0,0,"",0,{"$nulls":5},0,0,0]
[{"$nulls":7},{"$f":"SUMIF(Sprint!$J$6:$J$1833,F23,Sprint!$EI$6:$EI$1833)","v":0},0,null,0,0,0,0,"","",0,0,0,0,0,"","",0,0,0,0,0,"","",0,0,0,0,0,"","",0,0,0,0,{"$f":"IF(OR(WEEKDAY(AP$6)=7,WEEKDAY(AP$6)=1), \"\", 0)","v":0},"","",0,0,0,0,0,"",0,{"$nulls":5},0,0,0]
[{"$nulls":7},{"$f":"SUMIF(Sprint!$J$6:$J$1833,F24,Sprint!$EI$6:$EI$1833)","v":0},0,null,0,0,0,0,"","",0,0,0,0,0,"","",0,0,0,0,0,"","",0,0,0,0,0,"","",0,0,0,0,0,"","",0,0,0,0,0,"",0,{"$nulls":5},0,0,0]
[{"$nulls":7},{"$f":"SUMIF(Sprint!$J$6:$J$1833,F25,Sprint!$EI$6:$EI$1833)","v":0},0,null,0,0,0,0,"","",0,0,0,0,0,"","",0,0,0,0,0,"","",0,0,0,0,0,"","",0,0,0,0,0,"","",0,0,0,0,0,"",0,{"$nulls":5},0,0,0]
[{"$nulls":7},"Total ",null,null,{"$f":"SUM(K8:K25)","v":16},{"$f":"SUM(L8:L25)","v":12},16,0,0,0,0,8,8,8,0,0,0,0,8,8,8,0,0,0,0,8,8,8,0,0,0,0,0,0,0,0,0,0,0,0,0,0,0,0,{"$f":"SUM(AY8:BD25)","v":116},{"$nulls":4},0,14.5]
[{"$nulls":7},"Accumulated",null,null,{"$f":"K26","v":16},{"$f":"K27+L26","v":28},{"$f":"L27+M26","v":44},44,44,44,44,52,60,68,68,68,68,68,76,84,92,92,92,92,92,100,108,116,116,116,116,116,116,116,116,116,116,116,116,116,116,116,116,116]
[]
[{"$nulls":10},"H","=","Holidays"]
[{"$nulls":10},"OFF","=","OFF"]
[{"$nulls":10},"OA","=","Other activities"]

{"sheet":"Analysis","index":5,"n_rows":33,"n_cols":44,"rows_kept":33}
[]
[]
["Date",{"$nulls":3},{"$f":"INDEX(SprintDates,1,(E4-1)*BurndownColumns+1)","v":"2018-04-24"},{"$f":"INDEX(SprintDates,1,(F4-1)*BurndownColumns+1)","v":"2018-04-25"},"2018-04-26","2018-04-27","2018-04-28","2018-04-29","2018-04-30","2018-05-01","2018-05-02","2018-05-03","2018-05-04","2018-05-05","2018-05-06","2018-05-07","2018-05-08","2018-05-09","2018-05-10","2018-05-11","2018-05-12","2018-05-13","2018-05-14","2018-05-15","2018-05-16","2018-05-17","2018-05-18","2018-05-19","2018-05-20","2018-05-21","2018-05-22","2018-05-23","2018-05-24","2018-05-25","2018-05-26","2018-05-27","2018-05-28","2018-05-29","2018-05-30","2018-05-31","2018-06-01","2018-06-02"]
["Calendar Day ",{"$nulls":3},1,{"$f":"E4+1","v":2},{"$f":"F4+1","v":3},4,5,6,7,8,9,10,11,12,13,14,15,16,17,18,19,20,21,22,23,24,25,26,27,28,29,30,31,32,33,34,35,36,37,38,39,40]
["Current Remaining",{"$nulls":3},{"$f":"IF(E3>Capacity!$F$2, #N/A, SUM(INDEX(Burndown,,(E4-1)*BurndownColumns+HoursLeftColumn)))","v":28},{"$f":"IF(F3>Capacity!$F$2, #N/A, SUM(INDEX(Burndown,,(F4-1)*BurndownColumns+HoursLeftColumn)))","v":12},{"$f":"IF(G3>Capacity!$F$2, #N/A, SUM(INDEX(Burndown,,(G4-1)*BurndownColumns+HoursLeftColumn)))","v":12},{"$f":"IF(H3>Capacity!$F$2, #N/A, SUM(INDEX(Burndown,,(H4-1)*BurndownColumns+HoursLeftColumn)))","v":12},{"$f":"IF(I3>Capacity!$F$2, #N/A, SUM(INDEX(Burndown,,(I4-1)*BurndownColumns+HoursLeftColumn)))","v":12},{"$f":"IF(J3>Capacity!$F$2, #N/A, SUM(INDEX(Burndown,,(J4-1)*BurndownColumns+HoursLeftColumn)))","v":8},{"$f":"IF(K3>Capacity!$F$2, #N/A, SUM(INDEX(Burndown,,(K4-1)*BurndownColumns+HoursLeftColumn)))","v":8},{"$f":"IF(L3>Capacity!$F$2, #N/A, SUM(INDEX(Burndown,,(L4-1)*BurndownColumns+HoursLeftColumn)))","v":2},{"$f":"IF(M3>Capacity!$F$2, #N/A, SUM(INDEX(Burndown,,(M4-1)*BurndownColumns+HoursLeftColumn)))","v":2},{"$f":"IF(N3>Capacity!$F$2, #N/A, SUM(INDEX(Burndown,,(N4-1)*BurndownColumns+HoursLeftColumn)))","v":0},{"$f":"IF(O3>Capacity!$F$2, #N/A, SUM(INDEX(Burndown,,(O4-1)*BurndownColumns+HoursLeftColumn)))","v":0},{"$f":"IF(P3>Capacity!$F$2, #N/A, SUM(INDEX(Burndown,,(P4-1)*BurndownColumns+HoursLeftColumn)))","v":0},{"$f":"IF(Q3>Capacity!$F$2, #N/A, SUM(INDEX(Burndown,,(Q4-1)*BurndownColumns+HoursLeftColumn)))","v":0},{"$f":"IF(R3>Capacity!$F$2, #N/A, SUM(INDEX(Burndown,,(R4-1)*BurndownColumns+HoursLeftColumn)))","v":0},{"$f":"IF(S3>Capacity!$F$2, #N/A, SUM(INDEX(Burndown,,(S4-1)*BurndownColumns+HoursLeftColumn)))","v":0},{"$f":"IF(T3>Capacity!$F$2, #N/A, SUM(INDEX(Burndown,,(T4-1)*BurndownColumns+HoursLeftColumn)))","v":0},{"$f":"IF(U3>Capacity!$F$2, #N/A, SUM(INDEX(Burndown,,(U4-1)*BurndownColumns+HoursLeftColumn)))","v":0},{"$f":"IF(V3>Capacity!$F$2, #N/A, SUM(INDEX(Burndown,,(V4-1)*BurndownColumns+HoursLeftColumn)))","v":0},{"$f":"IF(W3>Capacity!$F$2, #N/A, SUM(INDEX(Burndown,,(W4-1)*BurndownColumns+HoursLeftColumn)))","v":0},{"$f":"IF(X3>Capacity!$F$2, #N/A, SUM(INDEX(Burndown,,(X4-1)*BurndownColumns+HoursLeftColumn)))","v":0},{"$f":"IF(Y3>Capacity!$F$2, #N/A, SUM(INDEX(Burndown,,(Y4-1)*BurndownColumns+HoursLeftColumn)))","v":0},{"$f":"IF(Z3>Capacity!$F$2, #N/A, SUM(INDEX(Burndown,,(Z4-1)*BurndownColumns+HoursLeftColumn)))","v":0},{"$f":"IF(AA3>Capacity!$F$2, #N/A, SUM(INDEX(Burndown,,(AA4-1)*BurndownColumns+HoursLeftColumn)))","v":0},{"$f":"IF(AB3>Capacity!$F$2, #N/A, SUM(INDEX(Burndown,,(AB4-1)*BurndownColumns+HoursLeftColumn)))","v":0},{"$f":"IF(AC3>Capacity!$F$2, #N/A, SUM(INDEX(Burndown,,(AC4-1)*BurndownColumns+HoursLeftColumn)))","v":0},{"$f":"IF(AD3>Capacity!$F$2, #N/A, SUM(INDEX(Burndown,,(AD4-1)*BurndownColumns+HoursLeftColumn)))","v":0},{"$f":"IF(AE3>Capacity!$F$2, #N/A, SUM(INDEX(Burndown,,(AE4-1)*BurndownColumns+HoursLeftColumn)))","v":0},{"$f":"IF(AF3>Capacity!$F$2, #N/A, SUM(INDEX(Burndown,,(AF4-1)*BurndownColumns+HoursLeftColumn)))","v":0},{"$f":"IF(AG3>Capacity!$F$2, #N/A, SUM(INDEX(Burndown,,(AG4-1)*BurndownColumns+HoursLeftColumn)))","v":0},{"$f":"IF(AH3>Capacity!$F$2, #N/A, SUM(INDEX(Burndown,,(AH4-1)*BurndownColumns+HoursLeftColumn)))","v":0},{"$f":"IF(AI3>Capacity!$F$2, #N/A, SUM(INDEX(Burndown,,(AI4-1)*BurndownColumns+HoursLeftColumn)))","v":0},{"$f":"IF(AJ3>Capacity!$F$2, #N/A, SUM(INDEX(Burndown,,(AJ4-1)*BurndownColumns+HoursLeftColumn)))","v":0},{"$f":"IF(AK3>Capacity!$F$2, #N/A, SUM(INDEX(Burndown,,(AK4-1)*BurndownColumns+HoursLeftColumn)))","v":0},{"$f":"IF(AL3>Capacity!$F$2, #N/A, SUM(INDEX(Burndown,,(AL4-1)*BurndownColumns+HoursLeftColumn)))","v":0},{"$f":"IF(AM3>Capacity!$F$2, #N/A, SUM(INDEX(Burndown,,(AM4-1)*BurndownColumns+HoursLeftColumn)))","v":0},{"$f":"IF(AN3>Capacity!$F$2, #N/A, SUM(INDEX(Burndown,,(AN4-1)*BurndownColumns+HoursLeftColumn)))","v":0},{"$f":"IF(AO3>Capacity!$F$2, #N/A, SUM(INDEX(Burndown,,(AO4-1)*BurndownColumns+HoursLeftColumn)))","v":0},{"$f":"IF(AP3>Capacity!$F$2, #N/A, SUM(INDEX(Burndown,,(AP4-1)*BurndownColumns+HoursLeftColumn)))","v":{"$error":"#N/A"}},{"$f":"IF(AQ3>Capacity!$F$2, #N/A, SUM(INDEX(Burndown,,(AQ4-1)*BurndownColumns+HoursLeftColumn)))","v":{"$error":"#N/A"}},{"$f":"IF(AR3>Capacity!$F$2, #N/A, SUM(INDEX(Burndown,,(AR4-1)*BurndownColumns+HoursLeftColumn)))","v":{"$error":"#N/A"}}]
["Current Spent in Day",{"$nulls":3},{"$f":"IF(E3>Capacity!$F$2, #N/A, SUM(INDEX(Burndown,,(E4-1)*BurndownColumns+HoursSpentColumn)))","v":4},{"$f":"IF(F3>Capacity!$F$2, #N/A, SUM(INDEX(Burndown,,(F4-1)*BurndownColumns+HoursSpentColumn)))","v":4},{"$f":"IF(G3>Capacity!$F$2, #N/A, SUM(INDEX(Burndown,,(G4-1)*BurndownColumns+HoursSpentColumn)))","v":12},{"$f":"IF(H3>Capacity!$F$2, #N/A, SUM(INDEX(Burndown,,(H4-1)*BurndownColumns+HoursSpentColumn)))","v":4},{"$f":"IF(I3>Capacity!$F$2, #N/A, SUM(INDEX(Burndown,,(I4-1)*BurndownColumns+HoursSpentColumn)))","v":4},{"$f":"IF(J3>Capacity!$F$2, #N/A, SUM(INDEX(Burndown,,(J4-1)*BurndownColumns+HoursSpentColumn)))","v":4},{"$f":"IF(K3>Capacity!$F$2, #N/A, SUM(INDEX(Burndown,,(K4-1)*BurndownColumns+HoursSpentColumn)))","v":4},{"$f":"IF(L3>Capacity!$F$2, #N/A, SUM(INDEX(Burndown,,(L4-1)*BurndownColumns+HoursSpentColumn)))","v":14},{"$f":"IF(M3>Capacity!$F$2, #N/A, SUM(INDEX(Burndown,,(M4-1)*BurndownColumns+HoursSpentColumn)))","v":0},{"$f":"IF(N3>Capacity!$F$2, #N/A, SUM(INDEX(Burndown,,(N4-1)*BurndownColumns+HoursSpentColumn)))","v":2},{"$f":"IF(O3>Capacity!$F$2, #N/A, SUM(INDEX(Burndown,,(O4-1)*BurndownColumns+HoursSpentColumn)))","v":0},{"$f":"IF(P3>Capacity!$F$2, #N/A, SUM(INDEX(Burndown,,(P4-1)*BurndownColumns+HoursSpentColumn)))","v":0},{"$f":"IF(Q3>Capacity!$F$2, #N/A, SUM(INDEX(Burndown,,(Q4-1)*BurndownColumns+HoursSpentColumn)))","v":0},{"$f":"IF(R3>Capacity!$F$2, #N/A, SUM(INDEX(Burndown,,(R4-1)*BurndownColumns+HoursSpentColumn)))","v":0},{"$f":"IF(S3>Capacity!$F$2, #N/A, SUM(INDEX(Burndown,,(S4-1)*BurndownColumns+HoursSpentColumn)))","v":0},{"$f":"IF(T3>Capacity!$F$2, #N/A, SUM(INDEX(Burndown,,(T4-1)*BurndownColumns+HoursSpentColumn)))","v":0},{"$f":"IF(U3>Capacity!$F$2, #N/A, SUM(INDEX(Burndown,,(U4-1)*BurndownColumns+HoursSpentColumn)))","v":0},{"$f":"IF(V3>Capacity!$F$2, #N/A, SUM(INDEX(Burndown,,(V4-1)*BurndownColumns+HoursSpentColumn)))","v":0},{"$f":"IF(W3>Capacity!$F$2, #N/A, SUM(INDEX(Burndown,,(W4-1)*BurndownColumns+HoursSpentColumn)))","v":0},{"$f":"IF(X3>Capacity!$F$2, #N/A, SUM(INDEX(Burndown,,(X4-1)*BurndownColumns+HoursSpentColumn)))","v":0},{"$f":"IF(Y3>Capacity!$F$2, #N/A, SUM(INDEX(Burndown,,(Y4-1)*BurndownColumns+HoursSpentColumn)))","v":0},{"$f":"IF(Z3>Capacity!$F$2, #N/A, SUM(INDEX(Burndown,,(Z4-1)*BurndownColumns+HoursSpentColumn)))","v":0},{"$f":"IF(AA3>Capacity!$F$2, #N/A, SUM(INDEX(Burndown,,(AA4-1)*BurndownColumns+HoursSpentColumn)))","v":0},{"$f":"IF(AB3>Capacity!$F$2, #N/A, SUM(INDEX(Burndown,,(AB4-1)*BurndownColumns+HoursSpentColumn)))","v":0},{"$f":"IF(AC3>Capacity!$F$2, #N/A, SUM(INDEX(Burndown,,(AC4-1)*BurndownColumns+HoursSpentColumn)))","v":0},{"$f":"IF(AD3>Capacity!$F$2, #N/A, SUM(INDEX(Burndown,,(AD4-1)*BurndownColumns+HoursSpentColumn)))","v":0},{"$f":"IF(AE3>Capacity!$F$2, #N/A, SUM(INDEX(Burndown,,(AE4-1)*BurndownColumns+HoursSpentColumn)))","v":0},{"$f":"IF(AF3>Capacity!$F$2, #N/A, SUM(INDEX(Burndown,,(AF4-1)*BurndownColumns+HoursSpentColumn)))","v":0},{"$f":"IF(AG3>Capacity!$F$2, #N/A, SUM(INDEX(Burndown,,(AG4-1)*BurndownColumns+HoursSpentColumn)))","v":0},{"$f":"IF(AH3>Capacity!$F$2, #N/A, SUM(INDEX(Burndown,,(AH4-1)*BurndownColumns+HoursSpentColumn)))","v":0},{"$f":"IF(AI3>Capacity!$F$2, #N/A, SUM(INDEX(Burndown,,(AI4-1)*BurndownColumns+HoursSpentColumn)))","v":0},{"$f":"IF(AJ3>Capacity!$F$2, #N/A, SUM(INDEX(Burndown,,(AJ4-1)*BurndownColumns+HoursSpentColumn)))","v":0},{"$f":"IF(AK3>Capacity!$F$2, #N/A, SUM(INDEX(Burndown,,(AK4-1)*BurndownColumns+HoursSpentColumn)))","v":0},{"$f":"IF(AL3>Capacity!$F$2, #N/A, SUM(INDEX(Burndown,,(AL4-1)*BurndownColumns+HoursSpentColumn)))","v":0},{"$f":"IF(AM3>Capacity!$F$2, #N/A, SUM(INDEX(Burndown,,(AM4-1)*BurndownColumns+HoursSpentColumn)))","v":0},{"$f":"IF(AN3>Capacity!$F$2, #N/A, SUM(INDEX(Burndown,,(AN4-1)*BurndownColumns+HoursSpentColumn)))","v":0},{"$f":"IF(AO3>Capacity!$F$2, #N/A, SUM(INDEX(Burndown,,(AO4-1)*BurndownColumns+HoursSpentColumn)))","v":0},{"$f":"IF(AP3>Capacity!$F$2, #N/A, SUM(INDEX(Burndown,,(AP4-1)*BurndownColumns+HoursSpentColumn)))","v":{"$error":"#N/A"}},{"$f":"IF(AQ3>Capacity!$F$2, #N/A, SUM(INDEX(Burndown,,(AQ4-1)*BurndownColumns+HoursSpentColumn)))","v":{"$error":"#N/A"}},{"$f":"IF(AR3>Capacity!$F$2, #N/A, SUM(INDEX(Burndown,,(AR4-1)*BurndownColumns+HoursSpentColumn)))","v":{"$error":"#N/A"}}]
["Current Spent",{"$nulls":3},{"$f":"IF(E3>Capacity!$F$2, #N/A, SUM($E6:E6))","v":4},{"$f":"IF(F3>Capacity!$F$2, #N/A, SUM($E6:F6))","v":8},{"$f":"IF(G3>Capacity!$F$2, #N/A, SUM($E6:G6))","v":20},{"$f":"IF(H3>Capacity!$F$2, #N/A, SUM($E6:H6))","v":24},{"$f":"IF(I3>Capacity!$F$2, #N/A, SUM($E6:I6))","v":28},{"$f":"IF(J3>Capacity!$F$2, #N/A, SUM($E6:J6))","v":32},{"$f":"IF(K3>Capacity!$F$2, #N/A, SUM($E6:K6))","v":36},{"$f":"IF(L3>Capacity!$F$2, #N/A, SUM($E6:L6))","v":50},{"$f":"IF(M3>Capacity!$F$2, #N/A, SUM($E6:M6))","v":50},{"$f":"IF(N3>Capacity!$F$2, #N/A, SUM($E6:N6))","v":52},{"$f":"IF(O3>Capacity!$F$2, #N/A, SUM($E6:O6))","v":52},{"$f":"IF(P3>Capacity!$F$2, #N/A, SUM($E6:P6))","v":52},{"$f":"IF(Q3>Capacity!$F$2, #N/A, SUM($E6:Q6))","v":52},{"$f":"IF(R3>Capacity!$F$2, #N/A, SUM($E6:R6))","v":52},{"$f":"IF(S3>Capacity!$F$2, #N/A, SUM($E6:S6))","v":52},{"$f":"IF(T3>Capacity!$F$2, #N/A, SUM($E6:T6))","v":52},{"$f":"IF(U3>Capacity!$F$2, #N/A, SUM($E6:U6))","v":52},{"$f":"IF(V3>Capacity!$F$2, #N/A, SUM($E6:V6))","v":52},{"$f":"IF(W3>Capacity!$F$2, #N/A, SUM($E6:W6))","v":52},{"$f":"IF(X3>Capacity!$F$2, #N/A, SUM($E6:X6))","v":52},{"$f":"IF(Y3>Capacity!$F$2, #N/A, SUM($E6:Y6))","v":52},{"$f":"IF(Z3>Capacity!$F$2, #N/A, SUM($E6:Z6))","v":52},{"$f":"IF(AA3>Capacity!$F$2, #N/A, SUM($E6:AA6))","v":52},{"$f":"IF(AB3>Capacity!$F$2, #N/A, SUM($E6:AB6))","v":52},{"$f":"IF(AC3>Capacity!$F$2, #N/A, SUM($E6:AC6))","v":52},{"$f":"IF(AD3>Capacity!$F$2, #N/A, SUM($E6:AD6))","v":52},{"$f":"IF(AE3>Capacity!$F$2, #N/A, SUM($E6:AE6))","v":52},{"$f":"IF(AF3>Capacity!$F$2, #N/A, SUM($E6:AF6))","v":52},{"$f":"IF(AG3>Capacity!$F$2, #N/A, SUM($E6:AG6))","v":52},{"$f":"IF(AH3>Capacity!$F$2, #N/A, SUM($E6:AH6))","v":52},{"$f":"IF(AI3>Capacity!$F$2, #N/A, SUM($E6:AI6))","v":52},{"$f":"IF(AJ3>Capacity!$F$2, #N/A, SUM($E6:AJ6))","v":52},{"$f":"IF(AK3>Capacity!$F$2, #N/A, SUM($E6:AK6))","v":52},{"$f":"IF(AL3>Capacity!$F$2, #N/A, SUM($E6:AL6))","v":52},{"$f":"IF(AM3>Capacity!$F$2, #N/A, SUM($E6:AM6))","v":52},{"$f":"IF(AN3>Capacity!$F$2, #N/A, SUM($E6:AN6))","v":52},{"$f":"IF(AO3>Capacity!$F$2, #N/A, SUM($E6:AO6))","v":52},{"$f":"IF(AP3>Capacity!$F$2, #N/A, SUM($E6:AP6))","v":{"$error":"#N/A"}},{"$f":"IF(AQ3>Capacity!$F$2, #N/A, SUM($E6:AQ6))","v":{"$error":"#N/A"}},{"$f":"IF(AR3>Capacity!$F$2, #N/A, SUM($E6:AR6))","v":{"$error":"#N/A"}}]
["Estimated Remaining + Spent",{"$nulls":3},{"$f":"IF(E3>Capacity!$F$2, #N/A, E5+E7)","v":32},{"$f":"IF(F3>Capacity!$F$2, #N/A, F5+F7)","v":20},{"$f":"IF(G3>Capacity!$F$2, #N/A, G5+G7)","v":32},{"$f":"IF(H3>Capacity!$F$2, #N/A, H5+H7)","v":36},{"$f":"IF(I3>Capacity!$F$2, #N/A, I5+I7)","v":40},{"$f":"IF(J3>Capacity!$F$2, #N/A, J5+J7)","v":40},{"$f":"IF(K3>Capacity!$F$2, #N/A, K5+K7)","v":44},{"$f":"IF(L3>Capacity!$F$2, #N/A, L5+L7)","v":52},{"$f":"IF(M3>Capacity!$F$2, #N/A, M5+M7)","v":52},{"$f":"IF(N3>Capacity!$F$2, #N/A, N5+N7)","v":52},{"$f":"IF(O3>Capacity!$F$2, #N/A, O5+O7)","v":52},{"$f":"IF(P3>Capacity!$F$2, #N/A, P5+P7)","v":52},{"$f":"IF(Q3>Capacity!$F$2, #N/A, Q5+Q7)","v":52},{"$f":"IF(R3>Capacity!$F$2, #N/A, R5+R7)","v":52},{"$f":"IF(S3>Capacity!$F$2, #N/A, S5+S7)","v":52},{"$f":"IF(T3>Capacity!$F$2, #N/A, T5+T7)","v":52},{"$f":"IF(U3>Capacity!$F$2, #N/A, U5+U7)","v":52},{"$f":"IF(V3>Capacity!$F$2, #N/A, V5+V7)","v":52},{"$f":"IF(W3>Capacity!$F$2, #N/A, W5+W7)","v":52},{"$f":"IF(X3>Capacity!$F$2, #N/A, X5+X7)","v":52},{"$f":"IF(Y3>Capacity!$F$2, #N/A, Y5+Y7)","v":52},{"$f":"IF(Z3>Capacity!$F$2, #N/A, Z5+Z7)","v":52},{"$f":"IF(AA3>Capacity!$F$2, #N/A, AA5+AA7)","v":52},{"$f":"IF(AB3>Capacity!$F$2, #N/A, AB5+AB7)","v":52},{"$f":"IF(AC3>Capacity!$F$2, #N/A, AC5+AC7)","v":52},{"$f":"IF(AD3>Capacity!$F$2, #N/A, AD5+AD7)","v":52},{"$f":"IF(AE3>Capacity!$F$2, #N/A, AE5+AE7)","v":52},{"$f":"IF(AF3>Capacity!$F$2, #N/A, AF5+AF7)","v":52},{"$f":"IF(AG3>Capacity!$F$2, #N/A, AG5+AG7)","v":52},{"$f":"IF(AH3>Capacity!$F$2, #N/A, AH5+AH7)","v":52},{"$f":"IF(AI3>Capacity!$F$2, #N/A, AI5+AI7)","v":52},{"$f":"IF(AJ3>Capacity!$F$2, #N/A, AJ5+AJ7)","v":52},{"$f":"IF(AK3>Capacity!$F$2, #N/A, AK5+AK7)","v":52},{"$f":"IF(AL3>Capacity!$F$2, #N/A, AL5+AL7)","v":52},{"$f":"IF(AM3>Capacity!$F$2, #N/A, AM5+AM7)","v":52},{"$f":"IF(AN3>Capacity!$F$2, #N/A, AN5+AN7)","v":52},{"$f":"IF(AO3>Capacity!$F$2, #N/A, AO5+AO7)","v":52},{"$f":"IF(AP3>Capacity!$F$2, #N/A, AP5+AP7)","v":{"$error":"#N/A"}},{"$f":"IF(AQ3>Capacity!$F$2, #N/A, AQ5+AQ7)","v":{"$error":"#N/A"}},{"$f":"IF(AR3>Capacity!$F$2, #N/A, AR5+AR7)","v":{"$error":"#N/A"}}]
["Forecast Remaining",{"$nulls":3},{"$f":"E5","v":28},{"$f":"IF(F3>=Capacity!$F$2,FORECAST(F4,OFFSET($E$5,0,0,1,HLOOKUP(Capacity!$F$2,$E$3:$AH$4,2)-1),OFFSET($E$4,0,0,1,HLOOKUP(Capacity!$F$2,$E$3:$AH$4,2)-1)),F5)","v":12},{"$f":"IF(G3>=Capacity!$F$2,FORECAST(G4,OFFSET($E$5,0,0,1,HLOOKUP(Capacity!$F$2,$E$3:$AH$4,2)-1),OFFSET($E$4,0,0,1,HLOOKUP(Capacity!$F$2,$E$3:$AH$4,2)-1)),G5)","v":12},{"$f":"IF(H3>=Capacity!$F$2,FORECAST(H4,OFFSET($E$5,0,0,1,HLOOKUP(Capacity!$F$2,$E$3:$AH$4,2)-1),OFFSET($E$4,0,0,1,HLOOKUP(Capacity!$F$2,$E$3:$AH$4,2)-1)),H5)","v":12},{"$f":"IF(I3>=Capacity!$F$2,FORECAST(I4,OFFSET($E$5,0,0,1,HLOOKUP(Capacity!$F$2,$E$3:$AH$4,2)-1),OFFSET($E$4,0,0,1,HLOOKUP(Capacity!$F$2,$E$3:$AH$4,2)-1)),I5)","v":12},{"$f":"IF(J3>=Capacity!$F$2,FORECAST(J4,OFFSET($E$5,0,0,1,HLOOKUP(Capacity!$F$2,$E$3:$AH$4,2)-1),OFFSET($E$4,0,0,1,HLOOKUP(Capacity!$F$2,$E$3:$AH$4,2)-1)),J5)","v":8},{"$f":"IF(K3>=Capacity!$F$2,FORECAST(K4,OFFSET($E$5,0,0,1,HLOOKUP(Capacity!$F$2,$E$3:$AH$4,2)-1),OFFSET($E$4,0,0,1,HLOOKUP(Capacity!$F$2,$E$3:$AH$4,2)-1)),K5)","v":8},{"$f":"IF(L3>=Capacity!$F$2,FORECAST(L4,OFFSET($E$5,0,0,1,HLOOKUP(Capacity!$F$2,$E$3:$AH$4,2)-1),OFFSET($E$4,0,0,1,HLOOKUP(Capacity!$F$2,$E$3:$AH$4,2)-1)),L5)","v":2},{"$f":"IF(M3>=Capacity!$F$2,FORECAST(M4,OFFSET($E$5,0,0,1,HLOOKUP(Capacity!$F$2,$E$3:$AH$4,2)-1),OFFSET($E$4,0,0,1,HLOOKUP(Capacity!$F$2,$E$3:$AH$4,2)-1)),M5)","v":2},{"$f":"IF(N3>=Capacity!$F$2,FORECAST(N4,OFFSET($E$5,0,0,1,HLOOKUP(Capacity!$F$2,$E$3:$AH$4,2)-1),OFFSET($E$4,0,0,1,HLOOKUP(Capacity!$F$2,$E$3:$AH$4,2)-1)),N5)","v":0},{"$f":"IF(O3>=Capacity!$F$2,FORECAST(O4,OFFSET($E$5,0,0,1,HLOOKUP(Capacity!$F$2,$E$3:$AH$4,2)-1),OFFSET($E$4,0,0,1,HLOOKUP(Capacity!$F$2,$E$3:$AH$4,2)-1)),O5)","v":0},{"$f":"IF(P3>=Capacity!$F$2,FORECAST(P4,OFFSET($E$5,0,0,1,HLOOKUP(Capacity!$F$2,$E$3:$AH$4,2)-1),OFFSET($E$4,0,0,1,HLOOKUP(Capacity!$F$2,$E$3:$AH$4,2)-1)),P5)","v":0},{"$f":"IF(Q3>=Capacity!$F$2,FORECAST(Q4,OFFSET($E$5,0,0,1,HLOOKUP(Capacity!$F$2,$E$3:$AH$4,2)-1),OFFSET($E$4,0,0,1,HLOOKUP(Capacity!$F$2,$E$3:$AH$4,2)-1)),Q5)","v":0},{"$f":"IF(R3>=Capacity!$F$2,FORECAST(R4,OFFSET($E$5,0,0,1,HLOOKUP(Capacity!$F$2,$E$3:$AH$4,2)-1),OFFSET($E$4,0,0,1,HLOOKUP(Capacity!$F$2,$E$3:$AH$4,2)-1)),R5)","v":0},{"$f":"IF(S3>=Capacity!$F$2,FORECAST(S4,OFFSET($E$5,0,0,1,HLOOKUP(Capacity!$F$2,$E$3:$AH$4,2)-1),OFFSET($E$4,0,0,1,HLOOKUP(Capacity!$F$2,$E$3:$AH$4,2)-1)),S5)","v":0},{"$f":"IF(T3>=Capacity!$F$2,FORECAST(T4,OFFSET($E$5,0,0,1,HLOOKUP(Capacity!$F$2,$E$3:$AH$4,2)-1),OFFSET($E$4,0,0,1,HLOOKUP(Capacity!$F$2,$E$3:$AH$4,2)-1)),T5)","v":0},{"$f":"IF(U3>=Capacity!$F$2,FORECAST(U4,OFFSET($E$5,0,0,1,HLOOKUP(Capacity!$F$2,$E$3:$AH$4,2)-1),OFFSET($E$4,0,0,1,HLOOKUP(Capacity!$F$2,$E$3:$AH$4,2)-1)),U5)","v":0},{"$f":"IF(V3>=Capacity!$F$2,FORECAST(V4,OFFSET($E$5,0,0,1,HLOOKUP(Capacity!$F$2,$E$3:$AH$4,2)-1),OFFSET($E$4,0,0,1,HLOOKUP(Capacity!$F$2,$E$3:$AH$4,2)-1)),V5)","v":0},{"$f":"IF(W3>=Capacity!$F$2,FORECAST(W4,OFFSET($E$5,0,0,1,HLOOKUP(Capacity!$F$2,$E$3:$AH$4,2)-1),OFFSET($E$4,0,0,1,HLOOKUP(Capacity!$F$2,$E$3:$AH$4,2)-1)),W5)","v":0},{"$f":"IF(X3>=Capacity!$F$2,FORECAST(X4,OFFSET($E$5,0,0,1,HLOOKUP(Capacity!$F$2,$E$3:$AH$4,2)-1),OFFSET($E$4,0,0,1,HLOOKUP(Capacity!$F$2,$E$3:$AH$4,2)-1)),X5)","v":0},{"$f":"IF(Y3>=Capacity!$F$2,FORECAST(Y4,OFFSET($E$5,0,0,1,HLOOKUP(Capacity!$F$2,$E$3:$AH$4,2)-1),OFFSET($E$4,0,0,1,HLOOKUP(Capacity!$F$2,$E$3:$AH$4,2)-1)),Y5)","v":0},{"$f":"IF(Z3>=Capacity!$F$2,FORECAST(Z4,OFFSET($E$5,0,0,1,HLOOKUP(Capacity!$F$2,$E$3:$AH$4,2)-1),OFFSET($E$4,0,0,1,HLOOKUP(Capacity!$F$2,$E$3:$AH$4,2)-1)),Z5)","v":0},{"$f":"IF(AA3>=Capacity!$F$2,FORECAST(AA4,OFFSET($E$5,0,0,1,HLOOKUP(Capacity!$F$2,$E$3:$AH$4,2)-1),OFFSET($E$4,0,0,1,HLOOKUP(Capacity!$F$2,$E$3:$AH$4,2)-1)),AA5)","v":0},{"$f":"IF(AB3>=Capacity!$F$2,FORECAST(AB4,OFFSET($E$5,0,0,1,HLOOKUP(Capacity!$F$2,$E$3:$AH$4,2)-1),OFFSET($E$4,0,0,1,HLOOKUP(Capacity!$F$2,$E$3:$AH$4,2)-1)),AB5)","v":0},{"$f":"IF(AC3>=Capacity!$F$2,FORECAST(AC4,OFFSET($E$5,0,0,1,HLOOKUP(Capacity!$F$2,$E$3:$AH$4,2)-1),OFFSET($E$4,0,0,1,HLOOKUP(Capacity!$F$2,$E$3:$AH$4,2)-1)),AC5)","v":0},{"$f":"IF(AD3>=Capacity!$F$2,FORECAST(AD4,OFFSET($E$5,0,0,1,HLOOKUP(Capacity!$F$2,$E$3:$AH$4,2)-1),OFFSET($E$4,0,0,1,HLOOKUP(Capacity!$F$2,$E$3:$AH$4,2)-1)),AD5)","v":0},{"$f":"IF(AE3>=Capacity!$F$2,FORECAST(AE4,OFFSET($E$5,0,0,1,HLOOKUP(Capacity!$F$2,$E$3:$AH$4,2)-1),OFFSET($E$4,0,0,1,HLOOKUP(Capacity!$F$2,$E$3:$AH$4,2)-1)),AE5)","v":0},{"$f":"IF(AF3>=Capacity!$F$2,FORECAST(AF4,OFFSET($E$5,0,0,1,HLOOKUP(Capacity!$F$2,$E$3:$AH$4,2)-1),OFFSET($E$4,0,0,1,HLOOKUP(Capacity!$F$2,$E$3:$AH$4,2)-1)),AF5)","v":0},{"$f":"IF(AG3>=Capacity!$F$2,FORECAST(AG4,OFFSET($E$5,0,0,1,HLOOKUP(Capacity!$F$2,$E$3:$AH$4,2)-1),OFFSET($E$4,0,0,1,HLOOKUP(Capacity!$F$2,$E$3:$AH$4,2)-1)),AG5)","v":0},{"$f":"IF(AH3>=Capacity!$F$2,FORECAST(AH4,OFFSET($E$5,0,0,1,HLOOKUP(Capacity!$F$2,$E$3:$AH$4,2)-1),OFFSET($E$4,0,0,1,HLOOKUP(Capacity!$F$2,$E$3:$AH$4,2)-1)),AH5)","v":0},{"$f":"IF(AI3>=Capacity!$F$2,FORECAST(AI4,OFFSET($E$5,0,0,1,HLOOKUP(Capacity!$F$2,$E$3:$AH$4,2)-1),OFFSET($E$4,0,0,1,HLOOKUP(Capacity!$F$2,$E$3:$AH$4,2)-1)),AI5)","v":0},{"$f":"IF(AJ3>=Capacity!$F$2,FORECAST(AJ4,OFFSET($E$5,0,0,1,HLOOKUP(Capacity!$F$2,$E$3:$AH$4,2)-1),OFFSET($E$4,0,0,1,HLOOKUP(Capacity!$F$2,$E$3:$AH$4,2)-1)),AJ5)","v":0},{"$f":"IF(AK3>=Capacity!$F$2,FORECAST(AK4,OFFSET($E$5,0,0,1,HLOOKUP(Capacity!$F$2,$E$3:$AH$4,2)-1),OFFSET($E$4,0,0,1,HLOOKUP(Capacity!$F$2,$E$3:$AH$4,2)-1)),AK5)","v":0},{"$f":"IF(AL3>=Capacity!$F$2,FORECAST(AL4,OFFSET($E$5,0,0,1,HLOOKUP(Capacity!$F$2,$E$3:$AH$4,2)-1),OFFSET($E$4,0,0,1,HLOOKUP(Capacity!$F$2,$E$3:$AH$4,2)-1)),AL5)","v":0},{"$f":"IF(AM3>=Capacity!$F$2,FORECAST(AM4,OFFSET($E$5,0,0,1,HLOOKUP(Capacity!$F$2,$E$3:$AH$4,2)-1),OFFSET($E$4,0,0,1,HLOOKUP(Capacity!$F$2,$E$3:$AH$4,2)-1)),AM5)","v":0},{"$f":"IF(AN3>=Capacity!$F$2,FORECAST(AN4,OFFSET($E$5,0,0,1,HLOOKUP(Capacity!$F$2,$E$3:$AH$4,2)-1),OFFSET($E$4,0,0,1,HLOOKUP(Capacity!$F$2,$E$3:$AH$4,2)-1)),AN5)","v":0},{"$f":"IF(AO3>=Capacity!$F$2,FORECAST(AO4,OFFSET($E$5,0,0,1,HLOOKUP(Capacity!$F$2,$E$3:$AH$4,2)-1),OFFSET($E$4,0,0,1,HLOOKUP(Capacity!$F$2,$E$3:$AH$4,2)-1)),AO5)","v":-8.675862068965518},{"$f":"IF(AP3>=Capacity!$F$2,FORECAST(AP4,OFFSET($E$5,0,0,1,HLOOKUP(Capacity!$F$2,$E$3:$AH$4,2)-1),OFFSET($E$4,0,0,1,HLOOKUP(Capacity!$F$2,$E$3:$AH$4,2)-1)),AP5)","v":-9.220689655172414},{"$f":"IF(AQ3>=Capacity!$F$2,FORECAST(AQ4,OFFSET($E$5,0,0,1,HLOOKUP(Capacity!$F$2,$E$3:$AH$4,2)-1),OFFSET($E$4,0,0,1,HLOOKUP(Capacity!$F$2,$E$3:$AH$4,2)-1)),AQ5)","v":-9.76551724137931},{"$f":"IF(AR3>=Capacity!$F$2,FORECAST(AR4,OFFSET($E$5,0,0,1,HLOOKUP(Capacity!$F$2,$E$3:$AH$4,2)-1),OFFSET($E$4,0,0,1,HLOOKUP(Capacity!$F$2,$E$3:$AH$4,2)-1)),AR5)","v":-10.310344827586206}]
["Planned Remaining",{"$nulls":3},{"$f":"PlanEffort-E11","v":20},8,-8,-8,-8,-8,-8,-16,-24,-32,-32,-32,-32,-32,-40,-48,-56,-56,-56,-56,-56,-64,-72,-80,-80,-80,-80,-80,-80,-80,-80,-80,-80,-80,-80,-80,-80,-80,-80,-80]
["Planned Capacity",{"$nulls":3},{"$f":"Capacity!K27","v":16},{"$f":"Capacity!L27","v":28},{"$f":"Capacity!M27","v":44},{"$f":"Capacity!N27","v":44},{"$f":"Capacity!O27","v":44},{"$f":"Capacity!P27","v":44},{"$f":"Capacity!Q27","v":44},{"$f":"Capacity!R27","v":52},{"$f":"Capacity!S27","v":60},{"$f":"Capacity!T27","v":68},{"$f":"Capacity!U27","v":68},{"$f":"Capacity!V27","v":68},{"$f":"Capacity!W27","v":68},{"$f":"Capacity!X27","v":68},{"$f":"Capacity!Y27","v":76},{"$f":"Capacity!Z27","v":84},{"$f":"Capacity!AA27","v":92},{"$f":"Capacity!AB27","v":92},{"$f":"Capacity!AC27","v":92},{"$f":"Capacity!AD27","v":92},{"$f":"Capacity!AE27","v":92},{"$f":"Capacity!AF27","v":100},{"$f":"Capacity!AG27","v":108},{"$f":"Capacity!AH27","v":116},{"$f":"Capacity!AI27","v":116},{"$f":"Capacity!AJ27","v":116},{"$f":"Capacity!AK27","v":116},{"$f":"Capacity!AL27","v":116},{"$f":"Capacity!AM27","v":116},{"$f":"Capacity!AN27","v":116},{"$f":"Capacity!AO27","v":116},{"$f":"Capacity!AP27","v":116},{"$f":"Capacity!AQ27","v":116},{"$f":"Capacity!AR27","v":116},{"$f":"Capacity!AS27","v":116},{"$f":"Capacity!AT27","v":116},{"$f":"Capacity!AU27","v":116},{"$f":"Capacity!AV27","v":116},{"$f":"Capacity!AW27","v":116},{"$f":"Capacity!AX27","v":116}]
[]
["Average Spent Per Day",{"$nulls":3},{"$f":"IF(ISERROR(E7),#N/A, E7/E4)","v":{"v":4,"d":"4.0"}},{"v":4,"d":"4.0"},{"v":6.666666666666667,"d":"6.7"},{"v":6,"d":"6.0"},{"$f":"IF(ISERROR(I7),#N/A, I7/I4)","v":5.6},{"v":5.333333333333333,"d":"5.3"},{"v":5.142857142857143,"d":"5.1"},{"v":6.25,"d":"6.3"},{"v":5.555555555555555,"d":"5.6"},5.2,{"v":4.7272727272727275,"d":"4.7"},{"v":4.333333333333333,"d":"4.3"},{"v":4,"d":"4.0"},{"v":3.7142857142857144,"d":"3.7"},{"v":3.466666666666667,"d":"3.5"},{"v":3.25,"d":"3.3"},{"v":3.0588235294117645,"d":"3.1"},{"v":2.888888888888889,"d":"2.9"},{"v":2.736842105263158,"d":"2.7"},2.6,{"v":2.4761904761904763,"d":"2.5"},{"v":2.3636363636363638,"d":"2.4"},{"v":2.260869565217391,"d":"2.3"},{"v":2.1666666666666665,"d":"2.2"},{"v":2.08,"d":"2.1"},{"v":2,"d":"2.0"},{"v":1.9259259259259258,"d":"1.9"},{"v":1.8571428571428572,"d":"1.9"},{"v":1.793103448275862,"d":"1.8"},{"v":1.7333333333333334,"d":"1.7"},{"v":1.6774193548387097,"d":"1.7"},{"v":1.625,"d":"1.6"},{"v":1.5757575757575757,"d":"1.6"},{"v":1.5294117647058822,"d":"1.5"},{"v":1.4857142857142858,"d":"1.5"},{"v":1.4444444444444444,"d":"1.4"},{"v":1.4054054054054055,"d":"1.4"},{"$error":"#N/A"},{"$error":"#N/A"},{"$error":"#N/A"}]
["Estimated Completion Date (based in Avg Spent By Day)",{"$nulls":3},{"$f":"IF(OR(ISERROR(E5),ISERROR(E13)), #N/A, IF(E13=0, SprintStart, E3 + (E5/E13)))","v":"2018-05-01"},"2018-04-28","2018-04-27T19:12:00","2018-04-29","2018-04-30T03:25:42.857","2018-04-30T12:00:00","2018-05-01T13:20:00","2018-05-01T07:40:48","2018-05-02T08:38:24","2018-05-03","2018-05-04","2018-05-05","2018-05-06","2018-05-07","2018-05-08","2018-05-09","2018-05-10","2018-05-11","2018-05-12","2018-05-13","2018-05-14","2018-05-15","2018-05-16","2018-05-17","2018-05-18","2018-05-19","2018-05-20","2018-05-21","2018-05-22","2018-05-23","2018-05-24","2018-05-25","2018-05-26","2018-05-27","2018-05-28","2018-05-29","2018-05-30",{"$error":"#N/A"},{"$error":"#N/A"},{"$error":"#N/A"}]
["Estimated Completion Date (based in Avg Task completion)",{"$nulls":3},{"$f":"IF(E$3>Capacity!$F$2, #N/A, IF(E$19>0, SprintStart+((E$8*E$4)/E$19)-1, SprintStart))","v":"2018-04-25"},{"$f":"IF(F$3>Capacity!$F$2, #N/A, IF(F$19>0, SprintStart+((F$8*F$4)/F$19)-1, SprintStart))","v":"2018-04-24T06:00:00"},{"$f":"IF(G$3>Capacity!$F$2, #N/A, IF(G$19>0, SprintStart+((G$8*G$4)/G$19)-1, SprintStart))","v":"2018-04-26"},{"$f":"IF(H$3>Capacity!$F$2, #N/A, IF(H$19>0, SprintStart+((H$8*H$4)/H$19)-1, SprintStart))","v":"2018-04-27T12:00:00"},{"$f":"IF(I$3>Capacity!$F$2, #N/A, IF(I$19>0, SprintStart+((I$8*I$4)/I$19)-1, SprintStart))","v":"2018-04-29T06:00:00"},{"$f":"IF(J$3>Capacity!$F$2, #N/A, IF(J$19>0, SprintStart+((J$8*J$4)/J$19)-1, SprintStart))","v":"2018-04-28T10:54:32.727"},{"$f":"IF(K$3>Capacity!$F$2, #N/A, IF(K$19>0, SprintStart+((K$8*K$4)/K$19)-1, SprintStart))","v":"2018-04-30"},{"$f":"IF(L$3>Capacity!$F$2, #N/A, IF(L$19>0, SprintStart+((L$8*L$4)/L$19)-1, SprintStart))","v":"2018-05-01T07:40:48"},{"$f":"IF(M$3>Capacity!$F$2, #N/A, IF(M$19>0, SprintStart+((M$8*M$4)/M$19)-1, SprintStart))","v":"2018-05-02T08:38:24"},{"$f":"IF(N$3>Capacity!$F$2, #N/A, IF(N$19>0, SprintStart+((N$8*N$4)/N$19)-1, SprintStart))","v":"2018-05-03"},{"$f":"IF(O$3>Capacity!$F$2, #N/A, IF(O$19>0, SprintStart+((O$8*O$4)/O$19)-1, SprintStart))","v":"2018-05-04"},{"$f":"IF(P$3>Capacity!$F$2, #N/A, IF(P$19>0, SprintStart+((P$8*P$4)/P$19)-1, SprintStart))","v":"2018-05-05"},{"$f":"IF(Q$3>Capacity!$F$2, #N/A, IF(Q$19>0, SprintStart+((Q$8*Q$4)/Q$19)-1, SprintStart))","v":"2018-05-06"},{"$f":"IF(R$3>Capacity!$F$2, #N/A, IF(R$19>0, SprintStart+((R$8*R$4)/R$19)-1, SprintStart))","v":"2018-05-07"},{"$f":"IF(S$3>Capacity!$F$2, #N/A, IF(S$19>0, SprintStart+((S$8*S$4)/S$19)-1, SprintStart))","v":"2018-05-08"},{"$f":"IF(T$3>Capacity!$F$2, #N/A, IF(T$19>0, SprintStart+((T$8*T$4)/T$19)-1, SprintStart))","v":"2018-05-09"},{"$f":"IF(U$3>Capacity!$F$2, #N/A, IF(U$19>0, SprintStart+((U$8*U$4)/U$19)-1, SprintStart))","v":"2018-05-10"},{"$f":"IF(V$3>Capacity!$F$2, #N/A, IF(V$19>0, SprintStart+((V$8*V$4)/V$19)-1, SprintStart))","v":"2018-05-11"},{"$f":"IF(W$3>Capacity!$F$2, #N/A, IF(W$19>0, SprintStart+((W$8*W$4)/W$19)-1, SprintStart))","v":"2018-05-12"},{"$f":"IF(X$3>Capacity!$F$2, #N/A, IF(X$19>0, SprintStart+((X$8*X$4)/X$19)-1, SprintStart))","v":"2018-05-13"},{"$f":"IF(Y$3>Capacity!$F$2, #N/A, IF(Y$19>0, SprintStart+((Y$8*Y$4)/Y$19)-1, SprintStart))","v":"2018-05-14"},{"$f":"IF(Z$3>Capacity!$F$2, #N/A, IF(Z$19>0, SprintStart+((Z$8*Z$4)/Z$19)-1, SprintStart))","v":"2018-05-15"},{"$f":"IF(AA$3>Capacity!$F$2, #N/A, IF(AA$19>0, SprintStart+((AA$8*AA$4)/AA$19)-1, SprintStart))","v":"2018-05-16"},{"$f":"IF(AB$3>Capacity!$F$2, #N/A, IF(AB$19>0, SprintStart+((AB$8*AB$4)/AB$19)-1, SprintStart))","v":"2018-05-17"},{"$f":"IF(AC$3>Capacity!$F$2, #N/A, IF(AC$19>0, SprintStart+((AC$8*AC$4)/AC$19)-1, SprintStart))","v":"2018-05-18"},{"$f":"IF(AD$3>Capacity!$F$2, #N/A, IF(AD$19>0, SprintStart+((AD$8*AD$4)/AD$19)-1, SprintStart))","v":"2018-05-19"},{"$f":"IF(AE$3>Capacity!$F$2, #N/A, IF(AE$19>0, SprintStart+((AE$8*AE$4)/AE$19)-1, SprintStart))","v":"2018-05-20"},{"$f":"IF(AF$3>Capacity!$F$2, #N/A, IF(AF$19>0, SprintStart+((AF$8*AF$4)/AF$19)-1, SprintStart))","v":"2018-05-21"},{"$f":"IF(AG$3>Capacity!$F$2, #N/A, IF(AG$19>0, SprintStart+((AG$8*AG$4)/AG$19)-1, SprintStart))","v":"2018-05-22"},{"$f":"IF(AH$3>Capacity!$F$2, #N/A, IF(AH$19>0, SprintStart+((AH$8*AH$4)/AH$19)-1, SprintStart))","v":"2018-05-23"},{"$f":"IF(AI$3>Capacity!$F$2, #N/A, IF(AI$19>0, SprintStart+((AI$8*AI$4)/AI$19)-1, SprintStart))","v":"2018-05-24"},{"$f":"IF(AJ$3>Capacity!$F$2, #N/A, IF(AJ$19>0, SprintStart+((AJ$8*AJ$4)/AJ$19)-1, SprintStart))","v":"2018-05-25"},{"$f":"IF(AK$3>Capacity!$F$2, #N/A, IF(AK$19>0, SprintStart+((AK$8*AK$4)/AK$19)-1, SprintStart))","v":"2018-05-26"},{"$f":"IF(AL$3>Capacity!$F$2, #N/A, IF(AL$19>0, SprintStart+((AL$8*AL$4)/AL$19)-1, SprintStart))","v":"2018-05-27"},{"$f":"IF(AM$3>Capacity!$F$2, #N/A, IF(AM$19>0, SprintStart+((AM$8*AM$4)/AM$19)-1, SprintStart))","v":"2018-05-28"},{"$f":"IF(AN$3>Capacity!$F$2, #N/A, IF(AN$19>0, SprintStart+((AN$8*AN$4)/AN$19)-1, SprintStart))","v":"2018-05-29"},{"$f":"IF(AO$3>Capacity!$F$2, #N/A, IF(AO$19>0, SprintStart+((AO$8*AO$4)/AO$19)-1, SprintStart))","v":"2018-05-30"},{"$f":"IF(AP$3>Capacity!$F$2, #N/A, IF(AP$19>0, SprintStart+((AP$8*AP$4)/AP$19)-1, SprintStart))","v":{"$error":"#N/A"}},{"$f":"IF(AQ$3>Capacity!$F$2, #N/A, IF(AQ$19>0, SprintStart+((AQ$8*AQ$4)/AQ$19)-1, SprintStart))","v":{"$error":"#N/A"}},{"$f":"IF(AR$3>Capacity!$F$2, #N/A, IF(AR$19>0, SprintStart+((AR$8*AR$4)/AR$19)-1, SprintStart))","v":{"$error":"#N/A"}}]
["Tasks Hours"]
["To start",{"$nulls":3},{"$f":"IF(E$3>Capacity!$F$2, #N/A, SUMIF(INDEX(Burndown,,(E$4-1)*BurndownColumns+StatusColumn), \"=To start\",INDEX(Burndown,,(E$4-1)*BurndownColumns+HoursLeftColumn)))","v":28},{"$f":"IF(F$3>Capacity!$F$2, #N/A, SUMIF(INDEX(Burndown,,(F$4-1)*BurndownColumns+StatusColumn), \"=To start\",INDEX(Burndown,,(F$4-1)*BurndownColumns+HoursLeftColumn)))","v":12},{"$f":"IF(G$3>Capacity!$F$2, #N/A, SUMIF(INDEX(Burndown,,(G$4-1)*BurndownColumns+StatusColumn), \"=To start\",INDEX(Burndown,,(G$4-1)*BurndownColumns+HoursLeftColumn)))","v":12},{"$f":"IF(H$3>Capacity!$F$2, #N/A, SUMIF(INDEX(Burndown,,(H$4-1)*BurndownColumns+StatusColumn), \"=To start\",INDEX(Burndown,,(H$4-1)*BurndownColumns+HoursLeftColumn)))","v":12},{"$f":"IF(I$3>Capacity!$F$2, #N/A, SUMIF(INDEX(Burndown,,(I$4-1)*BurndownColumns+StatusColumn), \"=To start\",INDEX(Burndown,,(I$4-1)*BurndownColumns+HoursLeftColumn)))","v":12},{"$f":"IF(J$3>Capacity!$F$2, #N/A, SUMIF(INDEX(Burndown,,(J$4-1)*BurndownColumns+StatusColumn), \"=To start\",INDEX(Burndown,,(J$4-1)*BurndownColumns+HoursLeftColumn)))","v":8},{"$f":"IF(K$3>Capacity!$F$2, #N/A, SUMIF(INDEX(Burndown,,(K$4-1)*BurndownColumns+StatusColumn), \"=To start\",INDEX(Burndown,,(K$4-1)*BurndownColumns+HoursLeftColumn)))","v":8},{"$f":"IF(L$3>Capacity!$F$2, #N/A, SUMIF(INDEX(Burndown,,(L$4-1)*BurndownColumns+StatusColumn), \"=To start\",INDEX(Burndown,,(L$4-1)*BurndownColumns+HoursLeftColumn)))","v":2},{"$f":"IF(M$3>Capacity!$F$2, #N/A, SUMIF(INDEX(Burndown,,(M$4-1)*BurndownColumns+StatusColumn), \"=To start\",INDEX(Burndown,,(M$4-1)*BurndownColumns+HoursLeftColumn)))","v":2},{"$f":"IF(N$3>Capacity!$F$2, #N/A, SUMIF(INDEX(Burndown,,(N$4-1)*BurndownColumns+StatusColumn), \"=To start\",INDEX(Burndown,,(N$4-1)*BurndownColumns+HoursLeftColumn)))","v":0},{"$f":"IF(O$3>Capacity!$F$2, #N/A, SUMIF(INDEX(Burndown,,(O$4-1)*BurndownColumns+StatusColumn), \"=To start\",INDEX(Burndown,,(O$4-1)*BurndownColumns+HoursLeftColumn)))","v":0},{"$f":"IF(P$3>Capacity!$F$2, #N/A, SUMIF(INDEX(Burndown,,(P$4-1)*BurndownColumns+StatusColumn), \"=To start\",INDEX(Burndown,,(P$4-1)*BurndownColumns+HoursLeftColumn)))","v":0},{"$f":"IF(Q$3>Capacity!$F$2, #N/A, SUMIF(INDEX(Burndown,,(Q$4-1)*BurndownColumns+StatusColumn), \"=To start\",INDEX(Burndown,,(Q$4-1)*BurndownColumns+HoursLeftColumn)))","v":0},{"$f":"IF(R$3>Capacity!$F$2, #N/A, SUMIF(INDEX(Burndown,,(R$4-1)*BurndownColumns+StatusColumn), \"=To start\",INDEX(Burndown,,(R$4-1)*BurndownColumns+HoursLeftColumn)))","v":0},{"$f":"IF(S$3>Capacity!$F$2, #N/A, SUMIF(INDEX(Burndown,,(S$4-1)*BurndownColumns+StatusColumn), \"=To start\",INDEX(Burndown,,(S$4-1)*BurndownColumns+HoursLeftColumn)))","v":0},{"$f":"IF(T$3>Capacity!$F$2, #N/A, SUMIF(INDEX(Burndown,,(T$4-1)*BurndownColumns+StatusColumn), \"=To start\",INDEX(Burndown,,(T$4-1)*BurndownColumns+HoursLeftColumn)))","v":0},{"$f":"IF(U$3>Capacity!$F$2, #N/A, SUMIF(INDEX(Burndown,,(U$4-1)*BurndownColumns+StatusColumn), \"=To start\",INDEX(Burndown,,(U$4-1)*BurndownColumns+HoursLeftColumn)))","v":0},{"$f":"IF(V$3>Capacity!$F$2, #N/A, SUMIF(INDEX(Burndown,,(V$4-1)*BurndownColumns+StatusColumn), \"=To start\",INDEX(Burndown,,(V$4-1)*BurndownColumns+HoursLeftColumn)))","v":0},{"$f":"IF(W$3>Capacity!$F$2, #N/A, SUMIF(INDEX(Burndown,,(W$4-1)*BurndownColumns+StatusColumn), \"=To start\",INDEX(Burndown,,(W$4-1)*BurndownColumns+HoursLeftColumn)))","v":0},{"$f":"IF(X$3>Capacity!$F$2, #N/A, SUMIF(INDEX(Burndown,,(X$4-1)*BurndownColumns+StatusColumn), \"=To start\",INDEX(Burndown,,(X$4-1)*BurndownColumns+HoursLeftColumn)))","v":0},{"$f":"IF(Y$3>Capacity!$F$2, #N/A, SUMIF(INDEX(Burndown,,(Y$4-1)*BurndownColumns+StatusColumn), \"=To start\",INDEX(Burndown,,(Y$4-1)*BurndownColumns+HoursLeftColumn)))","v":0},{"$f":"IF(Z$3>Capacity!$F$2, #N/A, SUMIF(INDEX(Burndown,,(Z$4-1)*BurndownColumns+StatusColumn), \"=To start\",INDEX(Burndown,,(Z$4-1)*BurndownColumns+HoursLeftColumn)))","v":0},{"$f":"IF(AA$3>Capacity!$F$2, #N/A, SUMIF(INDEX(Burndown,,(AA$4-1)*BurndownColumns+StatusColumn), \"=To start\",INDEX(Burndown,,(AA$4-1)*BurndownColumns+HoursLeftColumn)))","v":0},{"$f":"IF(AB$3>Capacity!$F$2, #N/A, SUMIF(INDEX(Burndown,,(AB$4-1)*BurndownColumns+StatusColumn), \"=To start\",INDEX(Burndown,,(AB$4-1)*BurndownColumns+HoursLeftColumn)))","v":0},{"$f":"IF(AC$3>Capacity!$F$2, #N/A, SUMIF(INDEX(Burndown,,(AC$4-1)*BurndownColumns+StatusColumn), \"=To start\",INDEX(Burndown,,(AC$4-1)*BurndownColumns+HoursLeftColumn)))","v":0},{"$f":"IF(AD$3>Capacity!$F$2, #N/A, SUMIF(INDEX(Burndown,,(AD$4-1)*BurndownColumns+StatusColumn), \"=To start\",INDEX(Burndown,,(AD$4-1)*BurndownColumns+HoursLeftColumn)))","v":0},{"$f":"IF(AE$3>Capacity!$F$2, #N/A, SUMIF(INDEX(Burndown,,(AE$4-1)*BurndownColumns+StatusColumn), \"=To start\",INDEX(Burndown,,(AE$4-1)*BurndownColumns+HoursLeftColumn)))","v":0},{"$f":"IF(AF$3>Capacity!$F$2, #N/A, SUMIF(INDEX(Burndown,,(AF$4-1)*BurndownColumns+StatusColumn), \"=To start\",INDEX(Burndown,,(AF$4-1)*BurndownColumns+HoursLeftColumn)))","v":0},{"$f":"IF(AG$3>Capacity!$F$2, #N/A, SUMIF(INDEX(Burndown,,(AG$4-1)*BurndownColumns+StatusColumn), \"=To start\",INDEX(Burndown,,(AG$4-1)*BurndownColumns+HoursLeftColumn)))","v":0},{"$f":"IF(AH$3>Capacity!$F$2, #N/A, SUMIF(INDEX(Burndown,,(AH$4-1)*BurndownColumns+StatusColumn), \"=To start\",INDEX(Burndown,,(AH$4-1)*BurndownColumns+HoursLeftColumn)))","v":0},{"$f":"IF(AI$3>Capacity!$F$2, #N/A, SUMIF(INDEX(Burndown,,(AI$4-1)*BurndownColumns+StatusColumn), \"=To start\",INDEX(Burndown,,(AI$4-1)*BurndownColumns+HoursLeftColumn)))","v":0},{"$f":"IF(AJ$3>Capacity!$F$2, #N/A, SUMIF(INDEX(Burndown,,(AJ$4-1)*BurndownColumns+StatusColumn), \"=To start\",INDEX(Burndown,,(AJ$4-1)*BurndownColumns+HoursLeftColumn)))","v":0},{"$f":"IF(AK$3>Capacity!$F$2, #N/A, SUMIF(INDEX(Burndown,,(AK$4-1)*BurndownColumns+StatusColumn), \"=To start\",INDEX(Burndown,,(AK$4-1)*BurndownColumns+HoursLeftColumn)))","v":0},{"$f":"IF(AL$3>Capacity!$F$2, #N/A, SUMIF(INDEX(Burndown,,(AL$4-1)*BurndownColumns+StatusColumn), \"=To start\",INDEX(Burndown,,(AL$4-1)*BurndownColumns+HoursLeftColumn)))","v":0},{"$f":"IF(AM$3>Capacity!$F$2, #N/A, SUMIF(INDEX(Burndown,,(AM$4-1)*BurndownColumns+StatusColumn), \"=To start\",INDEX(Burndown,,(AM$4-1)*BurndownColumns+HoursLeftColumn)))","v":0},{"$f":"IF(AN$3>Capacity!$F$2, #N/A, SUMIF(INDEX(Burndown,,(AN$4-1)*BurndownColumns+StatusColumn), \"=To start\",INDEX(Burndown,,(AN$4-1)*BurndownColumns+HoursLeftColumn)))","v":0},{"$f":"IF(AO$3>Capacity!$F$2, #N/A, SUMIF(INDEX(Burndown,,(AO$4-1)*BurndownColumns+StatusColumn), \"=To start\",INDEX(Burndown,,(AO$4-1)*BurndownColumns+HoursLeftColumn)))","v":0},{"$f":"IF(AP$3>Capacity!$F$2, #N/A, SUMIF(INDEX(Burndown,,(AP$4-1)*BurndownColumns+StatusColumn), \"=To start\",INDEX(Burndown,,(AP$4-1)*BurndownColumns+HoursLeftColumn)))","v":{"$error":"#N/A"}},{"$f":"IF(AQ$3>Capacity!$F$2, #N/A, SUMIF(INDEX(Burndown,,(AQ$4-1)*BurndownColumns+StatusColumn), \"=To start\",INDEX(Burndown,,(AQ$4-1)*BurndownColumns+HoursLeftColumn)))","v":{"$error":"#N/A"}},{"$f":"IF(AR$3>Capacity!$F$2, #N/A, SUMIF(INDEX(Burndown,,(AR$4-1)*BurndownColumns+StatusColumn), \"=To start\",INDEX(Burndown,,(AR$4-1)*BurndownColumns+HoursLeftColumn)))","v":{"$error":"#N/A"}}]
["Running",{"$nulls":3},{"$f":"E$5-E$17","v":0},{"$f":"F$5-F$17","v":0},0,0,0,0,0,0,0,0,0,0,0,0,0,0,0,0,0,0,0,0,0,0,0,0,0,0,0,0,0,0,0,0,0,0,0,{"$error":"#N/A"},{"$error":"#N/A"},{"$error":"#N/A"}]
["Complete",{"$nulls":3},{"$f":"IF(E$3>Capacity!$F$2, #N/A, SUMIF(INDEX(Burndown,,(E$4-1)*BurndownColumns+StatusColumn), \"=Complete\",TotalEffort))","v":16},{"$f":"IF(F$3>Capacity!$F$2, #N/A, SUMIF(INDEX(Burndown,,(F$4-1)*BurndownColumns+StatusColumn), \"=Complete\",TotalEffort))","v":32},{"$f":"IF(G$3>Capacity!$F$2, #N/A, SUMIF(INDEX(Burndown,,(G$4-1)*BurndownColumns+StatusColumn), \"=Complete\",TotalEffort))","v":32},{"$f":"IF(H$3>Capacity!$F$2, #N/A, SUMIF(INDEX(Burndown,,(H$4-1)*BurndownColumns+StatusColumn), \"=Complete\",TotalEffort))","v":32},{"$f":"IF(I$3>Capacity!$F$2, #N/A, SUMIF(INDEX(Burndown,,(I$4-1)*BurndownColumns+StatusColumn), \"=Complete\",TotalEffort))","v":32},{"$f":"IF(J$3>Capacity!$F$2, #N/A, SUMIF(INDEX(Burndown,,(J$4-1)*BurndownColumns+StatusColumn), \"=Complete\",TotalEffort))","v":44},{"$f":"IF(K$3>Capacity!$F$2, #N/A, SUMIF(INDEX(Burndown,,(K$4-1)*BurndownColumns+StatusColumn), \"=Complete\",TotalEffort))","v":44},{"$f":"IF(L$3>Capacity!$F$2, #N/A, SUMIF(INDEX(Burndown,,(L$4-1)*BurndownColumns+StatusColumn), \"=Complete\",TotalEffort))","v":50},{"$f":"IF(M$3>Capacity!$F$2, #N/A, SUMIF(INDEX(Burndown,,(M$4-1)*BurndownColumns+StatusColumn), \"=Complete\",TotalEffort))","v":50},{"$f":"IF(N$3>Capacity!$F$2, #N/A, SUMIF(INDEX(Burndown,,(N$4-1)*BurndownColumns+StatusColumn), \"=Complete\",TotalEffort))","v":52},{"$f":"IF(O$3>Capacity!$F$2, #N/A, SUMIF(INDEX(Burndown,,(O$4-1)*BurndownColumns+StatusColumn), \"=Complete\",TotalEffort))","v":52},{"$f":"IF(P$3>Capacity!$F$2, #N/A, SUMIF(INDEX(Burndown,,(P$4-1)*BurndownColumns+StatusColumn), \"=Complete\",TotalEffort))","v":52},{"$f":"IF(Q$3>Capacity!$F$2, #N/A, SUMIF(INDEX(Burndown,,(Q$4-1)*BurndownColumns+StatusColumn), \"=Complete\",TotalEffort))","v":52},{"$f":"IF(R$3>Capacity!$F$2, #N/A, SUMIF(INDEX(Burndown,,(R$4-1)*BurndownColumns+StatusColumn), \"=Complete\",TotalEffort))","v":52},{"$f":"IF(S$3>Capacity!$F$2, #N/A, SUMIF(INDEX(Burndown,,(S$4-1)*BurndownColumns+StatusColumn), \"=Complete\",TotalEffort))","v":52},{"$f":"IF(T$3>Capacity!$F$2, #N/A, SUMIF(INDEX(Burndown,,(T$4-1)*BurndownColumns+StatusColumn), \"=Complete\",TotalEffort))","v":52},{"$f":"IF(U$3>Capacity!$F$2, #N/A, SUMIF(INDEX(Burndown,,(U$4-1)*BurndownColumns+StatusColumn), \"=Complete\",TotalEffort))","v":52},{"$f":"IF(V$3>Capacity!$F$2, #N/A, SUMIF(INDEX(Burndown,,(V$4-1)*BurndownColumns+StatusColumn), \"=Complete\",TotalEffort))","v":52},{"$f":"IF(W$3>Capacity!$F$2, #N/A, SUMIF(INDEX(Burndown,,(W$4-1)*BurndownColumns+StatusColumn), \"=Complete\",TotalEffort))","v":52},{"$f":"IF(X$3>Capacity!$F$2, #N/A, SUMIF(INDEX(Burndown,,(X$4-1)*BurndownColumns+StatusColumn), \"=Complete\",TotalEffort))","v":52},{"$f":"IF(Y$3>Capacity!$F$2, #N/A, SUMIF(INDEX(Burndown,,(Y$4-1)*BurndownColumns+StatusColumn), \"=Complete\",TotalEffort))","v":52},{"$f":"IF(Z$3>Capacity!$F$2, #N/A, SUMIF(INDEX(Burndown,,(Z$4-1)*BurndownColumns+StatusColumn), \"=Complete\",TotalEffort))","v":52},{"$f":"IF(AA$3>Capacity!$F$2, #N/A, SUMIF(INDEX(Burndown,,(AA$4-1)*BurndownColumns+StatusColumn), \"=Complete\",TotalEffort))","v":52},{"$f":"IF(AB$3>Capacity!$F$2, #N/A, SUMIF(INDEX(Burndown,,(AB$4-1)*BurndownColumns+StatusColumn), \"=Complete\",TotalEffort))","v":52},{"$f":"IF(AC$3>Capacity!$F$2, #N/A, SUMIF(INDEX(Burndown,,(AC$4-1)*BurndownColumns+StatusColumn), \"=Complete\",TotalEffort))","v":52},{"$f":"IF(AD$3>Capacity!$F$2, #N/A, SUMIF(INDEX(Burndown,,(AD$4-1)*BurndownColumns+StatusColumn), \"=Complete\",TotalEffort))","v":52},{"$f":"IF(AE$3>Capacity!$F$2, #N/A, SUMIF(INDEX(Burndown,,(AE$4-1)*BurndownColumns+StatusColumn), \"=Complete\",TotalEffort))","v":52},{"$f":"IF(AF$3>Capacity!$F$2, #N/A, SUMIF(INDEX(Burndown,,(AF$4-1)*BurndownColumns+StatusColumn), \"=Complete\",TotalEffort))","v":52},{"$f":"IF(AG$3>Capacity!$F$2, #N/A, SUMIF(INDEX(Burndown,,(AG$4-1)*BurndownColumns+StatusColumn), \"=Complete\",TotalEffort))","v":52},{"$f":"IF(AH$3>Capacity!$F$2, #N/A, SUMIF(INDEX(Burndown,,(AH$4-1)*BurndownColumns+StatusColumn), \"=Complete\",TotalEffort))","v":52},{"$f":"IF(AI$3>Capacity!$F$2, #N/A, SUMIF(INDEX(Burndown,,(AI$4-1)*BurndownColumns+StatusColumn), \"=Complete\",TotalEffort))","v":52},{"$f":"IF(AJ$3>Capacity!$F$2, #N/A, SUMIF(INDEX(Burndown,,(AJ$4-1)*BurndownColumns+StatusColumn), \"=Complete\",TotalEffort))","v":52},{"$f":"IF(AK$3>Capacity!$F$2, #N/A, SUMIF(INDEX(Burndown,,(AK$4-1)*BurndownColumns+StatusColumn), \"=Complete\",TotalEffort))","v":52},{"$f":"IF(AL$3>Capacity!$F$2, #N/A, SUMIF(INDEX(Burndown,,(AL$4-1)*BurndownColumns+StatusColumn), \"=Complete\",TotalEffort))","v":52},{"$f":"IF(AM$3>Capacity!$F$2, #N/A, SUMIF(INDEX(Burndown,,(AM$4-1)*BurndownColumns+StatusColumn), \"=Complete\",TotalEffort))","v":52},{"$f":"IF(AN$3>Capacity!$F$2, #N/A, SUMIF(INDEX(Burndown,,(AN$4-1)*BurndownColumns+StatusColumn), \"=Complete\",TotalEffort))","v":52},{"$f":"IF(AO$3>Capacity!$F$2, #N/A, SUMIF(INDEX(Burndown,,(AO$4-1)*BurndownColumns+StatusColumn), \"=Complete\",TotalEffort))","v":52},{"$f":"IF(AP$3>Capacity!$F$2, #N/A, SUMIF(INDEX(Burndown,,(AP$4-1)*BurndownColumns+StatusColumn), \"=Complete\",TotalEffort))","v":{"$error":"#N/A"}},{"$f":"IF(AQ$3>Capacity!$F$2, #N/A, SUMIF(INDEX(Burndown,,(AQ$4-1)*BurndownColumns+StatusColumn), \"=Complete\",TotalEffort))","v":{"$error":"#N/A"}},{"$f":"IF(AR$3>Capacity!$F$2, #N/A, SUMIF(INDEX(Burndown,,(AR$4-1)*BurndownColumns+StatusColumn), \"=Complete\",TotalEffort))","v":{"$error":"#N/A"}}]
["Count of Tasks"]
["To start",{"$nulls":3},{"$f":"IF(E3>Capacity!$F$2, #N/A, COUNTIF(INDEX(Burndown,,(E4-1)*BurndownColumns+StatusColumn), \"=To start\"))","v":8},{"$f":"IF(F3>Capacity!$F$2, #N/A, COUNTIF(INDEX(Burndown,,(F4-1)*BurndownColumns+StatusColumn), \"=To start\"))","v":4},{"$f":"IF(G3>Capacity!$F$2, #N/A, COUNTIF(INDEX(Burndown,,(G4-1)*BurndownColumns+StatusColumn), \"=To start\"))","v":4},{"$f":"IF(H3>Capacity!$F$2, #N/A, COUNTIF(INDEX(Burndown,,(H4-1)*BurndownColumns+StatusColumn), \"=To start\"))","v":4},{"$f":"IF(I3>Capacity!$F$2, #N/A, COUNTIF(INDEX(Burndown,,(I4-1)*BurndownColumns+StatusColumn), \"=To start\"))","v":4},{"$f":"IF(J3>Capacity!$F$2, #N/A, COUNTIF(INDEX(Burndown,,(J4-1)*BurndownColumns+StatusColumn), \"=To start\"))","v":3},{"$f":"IF(K3>Capacity!$F$2, #N/A, COUNTIF(INDEX(Burndown,,(K4-1)*BurndownColumns+StatusColumn), \"=To start\"))","v":3},{"$f":"IF(L3>Capacity!$F$2, #N/A, COUNTIF(INDEX(Burndown,,(L4-1)*BurndownColumns+StatusColumn), \"=To start\"))","v":1},{"$f":"IF(M3>Capacity!$F$2, #N/A, COUNTIF(INDEX(Burndown,,(M4-1)*BurndownColumns+StatusColumn), \"=To start\"))","v":1},{"$f":"IF(N3>Capacity!$F$2, #N/A, COUNTIF(INDEX(Burndown,,(N4-1)*BurndownColumns+StatusColumn), \"=To start\"))","v":0},{"$f":"IF(O3>Capacity!$F$2, #N/A, COUNTIF(INDEX(Burndown,,(O4-1)*BurndownColumns+StatusColumn), \"=To start\"))","v":0},{"$f":"IF(P3>Capacity!$F$2, #N/A, COUNTIF(INDEX(Burndown,,(P4-1)*BurndownColumns+StatusColumn), \"=To start\"))","v":0},{"$f":"IF(Q3>Capacity!$F$2, #N/A, COUNTIF(INDEX(Burndown,,(Q4-1)*BurndownColumns+StatusColumn), \"=To start\"))","v":0},{"$f":"IF(R3>Capacity!$F$2, #N/A, COUNTIF(INDEX(Burndown,,(R4-1)*BurndownColumns+StatusColumn), \"=To start\"))","v":0},{"$f":"IF(S3>Capacity!$F$2, #N/A, COUNTIF(INDEX(Burndown,,(S4-1)*BurndownColumns+StatusColumn), \"=To start\"))","v":0},{"$f":"IF(T3>Capacity!$F$2, #N/A, COUNTIF(INDEX(Burndown,,(T4-1)*BurndownColumns+StatusColumn), \"=To start\"))","v":0},{"$f":"IF(U3>Capacity!$F$2, #N/A, COUNTIF(INDEX(Burndown,,(U4-1)*BurndownColumns+StatusColumn), \"=To start\"))","v":0},{"$f":"IF(V3>Capacity!$F$2, #N/A, COUNTIF(INDEX(Burndown,,(V4-1)*BurndownColumns+StatusColumn), \"=To start\"))","v":0},{"$f":"IF(W3>Capacity!$F$2, #N/A, COUNTIF(INDEX(Burndown,,(W4-1)*BurndownColumns+StatusColumn), \"=To start\"))","v":0},{"$f":"IF(X3>Capacity!$F$2, #N/A, COUNTIF(INDEX(Burndown,,(X4-1)*BurndownColumns+StatusColumn), \"=To start\"))","v":0},{"$f":"IF(Y3>Capacity!$F$2, #N/A, COUNTIF(INDEX(Burndown,,(Y4-1)*BurndownColumns+StatusColumn), \"=To start\"))","v":0},{"$f":"IF(Z3>Capacity!$F$2, #N/A, COUNTIF(INDEX(Burndown,,(Z4-1)*BurndownColumns+StatusColumn), \"=To start\"))","v":0},{"$f":"IF(AA3>Capacity!$F$2, #N/A, COUNTIF(INDEX(Burndown,,(AA4-1)*BurndownColumns+StatusColumn), \"=To start\"))","v":0},{"$f":"IF(AB3>Capacity!$F$2, #N/A, COUNTIF(INDEX(Burndown,,(AB4-1)*BurndownColumns+StatusColumn), \"=To start\"))","v":0},{"$f":"IF(AC3>Capacity!$F$2, #N/A, COUNTIF(INDEX(Burndown,,(AC4-1)*BurndownColumns+StatusColumn), \"=To start\"))","v":0},{"$f":"IF(AD3>Capacity!$F$2, #N/A, COUNTIF(INDEX(Burndown,,(AD4-1)*BurndownColumns+StatusColumn), \"=To start\"))","v":0},{"$f":"IF(AE3>Capacity!$F$2, #N/A, COUNTIF(INDEX(Burndown,,(AE4-1)*BurndownColumns+StatusColumn), \"=To start\"))","v":0},{"$f":"IF(AF3>Capacity!$F$2, #N/A, COUNTIF(INDEX(Burndown,,(AF4-1)*BurndownColumns+StatusColumn), \"=To start\"))","v":0},{"$f":"IF(AG3>Capacity!$F$2, #N/A, COUNTIF(INDEX(Burndown,,(AG4-1)*BurndownColumns+StatusColumn), \"=To start\"))","v":0},{"$f":"IF(AH3>Capacity!$F$2, #N/A, COUNTIF(INDEX(Burndown,,(AH4-1)*BurndownColumns+StatusColumn), \"=To start\"))","v":0},{"$f":"IF(AI3>Capacity!$F$2, #N/A, COUNTIF(INDEX(Burndown,,(AI4-1)*BurndownColumns+StatusColumn), \"=To start\"))","v":0},{"$f":"IF(AJ3>Capacity!$F$2, #N/A, COUNTIF(INDEX(Burndown,,(AJ4-1)*BurndownColumns+StatusColumn), \"=To start\"))","v":0},{"$f":"IF(AK3>Capacity!$F$2, #N/A, COUNTIF(INDEX(Burndown,,(AK4-1)*BurndownColumns+StatusColumn), \"=To start\"))","v":0},{"$f":"IF(AL3>Capacity!$F$2, #N/A, COUNTIF(INDEX(Burndown,,(AL4-1)*BurndownColumns+StatusColumn), \"=To start\"))","v":0},{"$f":"IF(AM3>Capacity!$F$2, #N/A, COUNTIF(INDEX(Burndown,,(AM4-1)*BurndownColumns+StatusColumn), \"=To start\"))","v":0},{"$f":"IF(AN3>Capacity!$F$2, #N/A, COUNTIF(INDEX(Burndown,,(AN4-1)*BurndownColumns+StatusColumn), \"=To start\"))","v":0},{"$f":"IF(AO3>Capacity!$F$2, #N/A, COUNTIF(INDEX(Burndown,,(AO4-1)*BurndownColumns+StatusColumn), \"=To start\"))","v":0},{"$f":"IF(AP3>Capacity!$F$2, #N/A, COUNTIF(INDEX(Burndown,,(AP4-1)*BurndownColumns+StatusColumn), \"=To start\"))","v":{"$error":"#N/A"}},{"$f":"IF(AQ3>Capacity!$F$2, #N/A, COUNTIF(INDEX(Burndown,,(AQ4-1)*BurndownColumns+StatusColumn), \"=To start\"))","v":{"$error":"#N/A"}},{"$f":"IF(AR3>Capacity!$F$2, #N/A, COUNTIF(INDEX(Burndown,,(AR4-1)*BurndownColumns+StatusColumn), \"=To start\"))","v":{"$error":"#N/A"}}]
["Running",{"$nulls":3},{"$f":"IF(E3>Capacity!$F$2, #N/A, COUNTIF(INDEX(Burndown,,(E4-1)*BurndownColumns+StatusColumn), \"=Running\"))","v":0},{"$f":"IF(F3>Capacity!$F$2, #N/A, COUNTIF(INDEX(Burndown,,(F4-1)*BurndownColumns+StatusColumn), \"=Running\"))","v":0},{"$f":"IF(G3>Capacity!$F$2, #N/A, COUNTIF(INDEX(Burndown,,(G4-1)*BurndownColumns+StatusColumn), \"=Running\"))","v":0},{"$f":"IF(H3>Capacity!$F$2, #N/A, COUNTIF(INDEX(Burndown,,(H4-1)*BurndownColumns+StatusColumn), \"=Running\"))","v":0},{"$f":"IF(I3>Capacity!$F$2, #N/A, COUNTIF(INDEX(Burndown,,(I4-1)*BurndownColumns+StatusColumn), \"=Running\"))","v":0},{"$f":"IF(J3>Capacity!$F$2, #N/A, COUNTIF(INDEX(Burndown,,(J4-1)*BurndownColumns+StatusColumn), \"=Running\"))","v":0},{"$f":"IF(K3>Capacity!$F$2, #N/A, COUNTIF(INDEX(Burndown,,(K4-1)*BurndownColumns+StatusColumn), \"=Running\"))","v":0},{"$f":"IF(L3>Capacity!$F$2, #N/A, COUNTIF(INDEX(Burndown,,(L4-1)*BurndownColumns+StatusColumn), \"=Running\"))","v":0},{"$f":"IF(M3>Capacity!$F$2, #N/A, COUNTIF(INDEX(Burndown,,(M4-1)*BurndownColumns+StatusColumn), \"=Running\"))","v":0},{"$f":"IF(N3>Capacity!$F$2, #N/A, COUNTIF(INDEX(Burndown,,(N4-1)*BurndownColumns+StatusColumn), \"=Running\"))","v":0},{"$f":"IF(O3>Capacity!$F$2, #N/A, COUNTIF(INDEX(Burndown,,(O4-1)*BurndownColumns+StatusColumn), \"=Running\"))","v":0},{"$f":"IF(P3>Capacity!$F$2, #N/A, COUNTIF(INDEX(Burndown,,(P4-1)*BurndownColumns+StatusColumn), \"=Running\"))","v":0},{"$f":"IF(Q3>Capacity!$F$2, #N/A, COUNTIF(INDEX(Burndown,,(Q4-1)*BurndownColumns+StatusColumn), \"=Running\"))","v":0},{"$f":"IF(R3>Capacity!$F$2, #N/A, COUNTIF(INDEX(Burndown,,(R4-1)*BurndownColumns+StatusColumn), \"=Running\"))","v":0},{"$f":"IF(S3>Capacity!$F$2, #N/A, COUNTIF(INDEX(Burndown,,(S4-1)*BurndownColumns+StatusColumn), \"=Running\"))","v":0},{"$f":"IF(T3>Capacity!$F$2, #N/A, COUNTIF(INDEX(Burndown,,(T4-1)*BurndownColumns+StatusColumn), \"=Running\"))","v":0},{"$f":"IF(U3>Capacity!$F$2, #N/A, COUNTIF(INDEX(Burndown,,(U4-1)*BurndownColumns+StatusColumn), \"=Running\"))","v":0},{"$f":"IF(V3>Capacity!$F$2, #N/A, COUNTIF(INDEX(Burndown,,(V4-1)*BurndownColumns+StatusColumn), \"=Running\"))","v":0},{"$f":"IF(W3>Capacity!$F$2, #N/A, COUNTIF(INDEX(Burndown,,(W4-1)*BurndownColumns+StatusColumn), \"=Running\"))","v":0},{"$f":"IF(X3>Capacity!$F$2, #N/A, COUNTIF(INDEX(Burndown,,(X4-1)*BurndownColumns+StatusColumn), \"=Running\"))","v":0},{"$f":"IF(Y3>Capacity!$F$2, #N/A, COUNTIF(INDEX(Burndown,,(Y4-1)*BurndownColumns+StatusColumn), \"=Running\"))","v":0},{"$f":"IF(Z3>Capacity!$F$2, #N/A, COUNTIF(INDEX(Burndown,,(Z4-1)*BurndownColumns+StatusColumn), \"=Running\"))","v":0},{"$f":"IF(AA3>Capacity!$F$2, #N/A, COUNTIF(INDEX(Burndown,,(AA4-1)*BurndownColumns+StatusColumn), \"=Running\"))","v":0},{"$f":"IF(AB3>Capacity!$F$2, #N/A, COUNTIF(INDEX(Burndown,,(AB4-1)*BurndownColumns+StatusColumn), \"=Running\"))","v":0},{"$f":"IF(AC3>Capacity!$F$2, #N/A, COUNTIF(INDEX(Burndown,,(AC4-1)*BurndownColumns+StatusColumn), \"=Running\"))","v":0},{"$f":"IF(AD3>Capacity!$F$2, #N/A, COUNTIF(INDEX(Burndown,,(AD4-1)*BurndownColumns+StatusColumn), \"=Running\"))","v":0},{"$f":"IF(AE3>Capacity!$F$2, #N/A, COUNTIF(INDEX(Burndown,,(AE4-1)*BurndownColumns+StatusColumn), \"=Running\"))","v":0},{"$f":"IF(AF3>Capacity!$F$2, #N/A, COUNTIF(INDEX(Burndown,,(AF4-1)*BurndownColumns+StatusColumn), \"=Running\"))","v":0},{"$f":"IF(AG3>Capacity!$F$2, #N/A, COUNTIF(INDEX(Burndown,,(AG4-1)*BurndownColumns+StatusColumn), \"=Running\"))","v":0},{"$f":"IF(AH3>Capacity!$F$2, #N/A, COUNTIF(INDEX(Burndown,,(AH4-1)*BurndownColumns+StatusColumn), \"=Running\"))","v":0},{"$f":"IF(AI3>Capacity!$F$2, #N/A, COUNTIF(INDEX(Burndown,,(AI4-1)*BurndownColumns+StatusColumn), \"=Running\"))","v":0},{"$f":"IF(AJ3>Capacity!$F$2, #N/A, COUNTIF(INDEX(Burndown,,(AJ4-1)*BurndownColumns+StatusColumn), \"=Running\"))","v":0},{"$f":"IF(AK3>Capacity!$F$2, #N/A, COUNTIF(INDEX(Burndown,,(AK4-1)*BurndownColumns+StatusColumn), \"=Running\"))","v":0},{"$f":"IF(AL3>Capacity!$F$2, #N/A, COUNTIF(INDEX(Burndown,,(AL4-1)*BurndownColumns+StatusColumn), \"=Running\"))","v":0},{"$f":"IF(AM3>Capacity!$F$2, #N/A, COUNTIF(INDEX(Burndown,,(AM4-1)*BurndownColumns+StatusColumn), \"=Running\"))","v":0},{"$f":"IF(AN3>Capacity!$F$2, #N/A, COUNTIF(INDEX(Burndown,,(AN4-1)*BurndownColumns+StatusColumn), \"=Running\"))","v":0},{"$f":"IF(AO3>Capacity!$F$2, #N/A, COUNTIF(INDEX(Burndown,,(AO4-1)*BurndownColumns+StatusColumn), \"=Running\"))","v":0},{"$f":"IF(AP3>Capacity!$F$2, #N/A, COUNTIF(INDEX(Burndown,,(AP4-1)*BurndownColumns+StatusColumn), \"=Running\"))","v":{"$error":"#N/A"}},{"$f":"IF(AQ3>Capacity!$F$2, #N/A, COUNTIF(INDEX(Burndown,,(AQ4-1)*BurndownColumns+StatusColumn), \"=Running\"))","v":{"$error":"#N/A"}},{"$f":"IF(AR3>Capacity!$F$2, #N/A, COUNTIF(INDEX(Burndown,,(AR4-1)*BurndownColumns+StatusColumn), \"=Running\"))","v":{"$error":"#N/A"}}]
["Complete",{"$nulls":3},{"$f":"IF(E3>Capacity!$F$2, #N/A, COUNTIFS(INDEX(Burndown,,(E4-1)*BurndownColumns+StatusColumn), \"=Complete\"))","v":2},{"$f":"IF(F3>Capacity!$F$2, #N/A, COUNTIF(INDEX(Burndown,,(F4-1)*BurndownColumns+StatusColumn), \"=Complete\"))","v":6},{"$f":"IF(G3>Capacity!$F$2, #N/A, COUNTIF(INDEX(Burndown,,(G4-1)*BurndownColumns+StatusColumn), \"=Complete\"))","v":6},{"$f":"IF(H3>Capacity!$F$2, #N/A, COUNTIF(INDEX(Burndown,,(H4-1)*BurndownColumns+StatusColumn), \"=Complete\"))","v":6},{"$f":"IF(I3>Capacity!$F$2, #N/A, COUNTIF(INDEX(Burndown,,(I4-1)*BurndownColumns+StatusColumn), \"=Complete\"))","v":6},{"$f":"IF(J3>Capacity!$F$2, #N/A, COUNTIF(INDEX(Burndown,,(J4-1)*BurndownColumns+StatusColumn), \"=Complete\"))","v":7},{"$f":"IF(K3>Capacity!$F$2, #N/A, COUNTIF(INDEX(Burndown,,(K4-1)*BurndownColumns+StatusColumn), \"=Complete\"))","v":7},{"$f":"IF(L3>Capacity!$F$2, #N/A, COUNTIF(INDEX(Burndown,,(L4-1)*BurndownColumns+StatusColumn), \"=Complete\"))","v":9},{"$f":"IF(M3>Capacity!$F$2, #N/A, COUNTIF(INDEX(Burndown,,(M4-1)*BurndownColumns+StatusColumn), \"=Complete\"))","v":9},{"$f":"IF(N3>Capacity!$F$2, #N/A, COUNTIF(INDEX(Burndown,,(N4-1)*BurndownColumns+StatusColumn), \"=Complete\"))","v":10},{"$f":"IF(O3>Capacity!$F$2, #N/A, COUNTIF(INDEX(Burndown,,(O4-1)*BurndownColumns+StatusColumn), \"=Complete\"))","v":10},{"$f":"IF(P3>Capacity!$F$2, #N/A, COUNTIF(INDEX(Burndown,,(P4-1)*BurndownColumns+StatusColumn), \"=Complete\"))","v":10},{"$f":"IF(Q3>Capacity!$F$2, #N/A, COUNTIF(INDEX(Burndown,,(Q4-1)*BurndownColumns+StatusColumn), \"=Complete\"))","v":10},{"$f":"IF(R3>Capacity!$F$2, #N/A, COUNTIF(INDEX(Burndown,,(R4-1)*BurndownColumns+StatusColumn), \"=Complete\"))","v":10},{"$f":"IF(S3>Capacity!$F$2, #N/A, COUNTIF(INDEX(Burndown,,(S4-1)*BurndownColumns+StatusColumn), \"=Complete\"))","v":10},{"$f":"IF(T3>Capacity!$F$2, #N/A, COUNTIF(INDEX(Burndown,,(T4-1)*BurndownColumns+StatusColumn), \"=Complete\"))","v":10},{"$f":"IF(U3>Capacity!$F$2, #N/A, COUNTIF(INDEX(Burndown,,(U4-1)*BurndownColumns+StatusColumn), \"=Complete\"))","v":10},{"$f":"IF(V3>Capacity!$F$2, #N/A, COUNTIF(INDEX(Burndown,,(V4-1)*BurndownColumns+StatusColumn), \"=Complete\"))","v":10},{"$f":"IF(W3>Capacity!$F$2, #N/A, COUNTIF(INDEX(Burndown,,(W4-1)*BurndownColumns+StatusColumn), \"=Complete\"))","v":10},{"$f":"IF(X3>Capacity!$F$2, #N/A, COUNTIF(INDEX(Burndown,,(X4-1)*BurndownColumns+StatusColumn), \"=Complete\"))","v":10},{"$f":"IF(Y3>Capacity!$F$2, #N/A, COUNTIF(INDEX(Burndown,,(Y4-1)*BurndownColumns+StatusColumn), \"=Complete\"))","v":10},{"$f":"IF(Z3>Capacity!$F$2, #N/A, COUNTIF(INDEX(Burndown,,(Z4-1)*BurndownColumns+StatusColumn), \"=Complete\"))","v":10},{"$f":"IF(AA3>Capacity!$F$2, #N/A, COUNTIF(INDEX(Burndown,,(AA4-1)*BurndownColumns+StatusColumn), \"=Complete\"))","v":10},{"$f":"IF(AB3>Capacity!$F$2, #N/A, COUNTIF(INDEX(Burndown,,(AB4-1)*BurndownColumns+StatusColumn), \"=Complete\"))","v":10},{"$f":"IF(AC3>Capacity!$F$2, #N/A, COUNTIF(INDEX(Burndown,,(AC4-1)*BurndownColumns+StatusColumn), \"=Complete\"))","v":10},{"$f":"IF(AD3>Capacity!$F$2, #N/A, COUNTIF(INDEX(Burndown,,(AD4-1)*BurndownColumns+StatusColumn), \"=Complete\"))","v":10},{"$f":"IF(AE3>Capacity!$F$2, #N/A, COUNTIF(INDEX(Burndown,,(AE4-1)*BurndownColumns+StatusColumn), \"=Complete\"))","v":10},{"$f":"IF(AF3>Capacity!$F$2, #N/A, COUNTIF(INDEX(Burndown,,(AF4-1)*BurndownColumns+StatusColumn), \"=Complete\"))","v":10},{"$f":"IF(AG3>Capacity!$F$2, #N/A, COUNTIF(INDEX(Burndown,,(AG4-1)*BurndownColumns+StatusColumn), \"=Complete\"))","v":10},{"$f":"IF(AH3>Capacity!$F$2, #N/A, COUNTIF(INDEX(Burndown,,(AH4-1)*BurndownColumns+StatusColumn), \"=Complete\"))","v":10},{"$f":"IF(AI3>Capacity!$F$2, #N/A, COUNTIF(INDEX(Burndown,,(AI4-1)*BurndownColumns+StatusColumn), \"=Complete\"))","v":10},{"$f":"IF(AJ3>Capacity!$F$2, #N/A, COUNTIF(INDEX(Burndown,,(AJ4-1)*BurndownColumns+StatusColumn), \"=Complete\"))","v":10},{"$f":"IF(AK3>Capacity!$F$2, #N/A, COUNTIF(INDEX(Burndown,,(AK4-1)*BurndownColumns+StatusColumn), \"=Complete\"))","v":10},{"$f":"IF(AL3>Capacity!$F$2, #N/A, COUNTIF(INDEX(Burndown,,(AL4-1)*BurndownColumns+StatusColumn), \"=Complete\"))","v":10},{"$f":"IF(AM3>Capacity!$F$2, #N/A, COUNTIF(INDEX(Burndown,,(AM4-1)*BurndownColumns+StatusColumn), \"=Complete\"))","v":10},{"$f":"IF(AN3>Capacity!$F$2, #N/A, COUNTIF(INDEX(Burndown,,(AN4-1)*BurndownColumns+StatusColumn), \"=Complete\"))","v":10},{"$f":"IF(AO3>Capacity!$F$2, #N/A, COUNTIF(INDEX(Burndown,,(AO4-1)*BurndownColumns+StatusColumn), \"=Complete\"))","v":10},{"$f":"IF(AP3>Capacity!$F$2, #N/A, COUNTIF(INDEX(Burndown,,(AP4-1)*BurndownColumns+StatusColumn), \"=Complete\"))","v":{"$error":"#N/A"}},{"$f":"IF(AQ3>Capacity!$F$2, #N/A, COUNTIF(INDEX(Burndown,,(AQ4-1)*BurndownColumns+StatusColumn), \"=Complete\"))","v":{"$error":"#N/A"}},{"$f":"IF(AR3>Capacity!$F$2, #N/A, COUNTIF(INDEX(Burndown,,(AR4-1)*BurndownColumns+StatusColumn), \"=Complete\"))","v":{"$error":"#N/A"}}]
[]
["Workbook Settings",{"$nulls":5},"Comments"]
[null,"SkipWeekends",null,null,0,null,"(0=30 calendar days; 1=30 working days). Set to 1 to have dates skip over weekends (30 working day sprint, >30 calendar day sprint). Do not switch after Sprint has started or data will be stored under wrong days "]
[null,"DailyScrumDateModifier",null,null,0,null,"Number of days added to or subtracted from today's date to ensure the highlighted date column in the sprint worksheet corresponds to the day of the current daily Scrum meeting"]
[]
["Workbook-Wide Constants"]
[null,"BurndownColumns",null,null,3]
[null,"HoursSpentColumn",null,null,1]
[null,"HoursLeftColumn",null,null,2]
[null,"StatusColumn",null,null,3]

{"sheet":"Project Report","index":6,"n_rows":26,"n_cols":4,"rows_kept":26}
["Work Type Breakdown","Count","Hours Sum","% Hours"]
["Feature",{"$f":"COUNTIF(Sprint!$A$7:$J$38, $A2)","v":10},{"$f":"SUMIF(Sprint!A:A,'Project Report'!$A2,Sprint!EI:EI)","v":52},{"$f":"C2/Table1[[#Totals],[Hours Sum]]","v":{"v":1,"d":"100%"}}]
["Tax",{"$f":"COUNTIF(Sprint!$A$7:$J$38, $A3)","v":0},{"$f":"SUMIF(Sprint!A:A,'Project Report'!$A3,Sprint!EI:EI)","v":0},{"$f":"C3/Table1[[#Totals],[Hours Sum]]","v":{"v":0,"d":"0%"}}]
["Precondition",{"$f":"COUNTIF(Sprint!$A$7:$J$38, $A4)","v":0},{"$f":"SUMIF(Sprint!A:A,'Project Report'!$A4,Sprint!EI:EI)","v":0},{"$f":"C4/Table1[[#Totals],[Hours Sum]]","v":{"v":0,"d":"0%"}}]
["Spike",{"$f":"COUNTIF(Sprint!$A$7:$J$38, $A5)","v":0},{"$f":"SUMIF(Sprint!A:A,'Project Report'!$A5,Sprint!EI:EI)","v":0},{"$f":"C5/Table1[[#Totals],[Hours Sum]]","v":{"v":0,"d":"0%"}}]
["Total",{"$f":"SUBTOTAL(109,Table1[Count])","v":10},{"$f":"SUBTOTAL(109,Table1[Hours Sum])","v":52},{"$f":"SUBTOTAL(109,Table1[% Hours])","v":{"v":1,"d":"100%"}}]
[]
[]
["Functional Breakdown","Count","Hours Sum","% Hours"]
["Management",{"$f":"COUNTIF(Sprint!$B$7:$J$38, $A10)","v":0},{"$f":"SUMIF(Sprint!B:B,'Project Report'!$A10,Sprint!EI:EI)","v":0},{"$f":"C10/Table2[[#Totals],[Hours Sum]]","v":{"v":0,"d":"0%"}}]
["Specification",{"$f":"COUNTIF(Sprint!$B$7:$J$38, $A11)","v":6},{"$f":"SUMIF(Sprint!B:B,'Project Report'!$A11,Sprint!EI:EI)","v":32},{"$f":"C11/Table2[[#Totals],[Hours Sum]]","v":{"v":0.6153846153846154,"d":"62%"}}]
["Development",{"$f":"COUNTIF(Sprint!$B$7:$J$38, $A12)","v":4},{"$f":"SUMIF(Sprint!B:B,'Project Report'!$A12,Sprint!EI:EI)","v":20},{"$f":"C12/Table2[[#Totals],[Hours Sum]]","v":{"v":0.38461538461538464,"d":"38%"}}]
["Documentation",{"$f":"COUNTIF(Sprint!$B$7:$J$38, $A13)","v":0},{"$f":"SUMIF(Sprint!B:B,'Project Report'!$A13,Sprint!EI:EI)","v":0},{"$f":"C13/Table2[[#Totals],[Hours Sum]]","v":{"v":0,"d":"0%"}}]
["Training",{"$f":"COUNTIF(Sprint!$B$7:$J$38, $A14)","v":0},{"$f":"SUMIF(Sprint!B:B,'Project Report'!$A14,Sprint!EI:EI)","v":0},{"$f":"C14/Table2[[#Totals],[Hours Sum]]","v":{"v":0,"d":"0%"}}]
["Acceptance",{"$f":"COUNTIF(Sprint!$B$7:$J$38, $A15)","v":0},{"$f":"SUMIF(Sprint!B:B,'Project Report'!$A15,Sprint!EI:EI)","v":0},{"$f":"C15/Table2[[#Totals],[Hours Sum]]","v":{"v":0,"d":"0%"}}]
["Go live",{"$f":"COUNTIF(Sprint!$B$7:$J$38, $A16)","v":0},{"$f":"SUMIF(Sprint!B:B,'Project Report'!$A16,Sprint!EI:EI)","v":0},{"$f":"C16/Table2[[#Totals],[Hours Sum]]","v":{"v":0,"d":"0%"}}]
["Total",{"$f":"SUBTOTAL(109,Table2[Count])","v":10},{"$f":"SUBTOTAL(109,Table2[Hours Sum])","v":52},{"$f":"SUBTOTAL(109,Table2[% Hours])","v":{"v":1,"d":"100%"}}]
[]
[]
["Work Item Status","Count","Hours Sum","% Hours"]
["Complete",{"$f":"COUNTIF(Sprint!$K:K, $A21)","v":10},{"$f":"SUMIF(Sprint!K:K,'Project Report'!$A21,Sprint!EI:EI)","v":52},{"$f":"Table3[[#This Row],[Hours Sum]]/Table3[[#Totals],[Hours Sum]]","v":{"v":1,"d":"100%"}}]
["To Start",{"$f":"COUNTIF(Sprint!$K:K, $A22)","v":0},{"$f":"SUMIF(Sprint!K:K,'Project Report'!$A22,Sprint!EI:EI)","v":0},{"$f":"Table3[[#This Row],[Hours Sum]]/Table3[[#Totals],[Hours Sum]]","v":{"v":0,"d":"0%"}}]
["Running",{"$f":"COUNTIF(Sprint!$K:K, $A23)","v":0},{"$f":"SUMIF(Sprint!K:K,'Project Report'!$A23,Sprint!EI:EI)","v":0},{"$f":"Table3[[#This Row],[Hours Sum]]/Table3[[#Totals],[Hours Sum]]","v":{"v":0,"d":"0%"}}]
["Posponed",{"$f":"COUNTIF(Sprint!$K:K, $A24)","v":0},{"$f":"SUMIF(Sprint!K:K,'Project Report'!$A24,Sprint!EI:EI)","v":0},{"$f":"Table3[[#This Row],[Hours Sum]]/Table3[[#Totals],[Hours Sum]]","v":{"v":0,"d":"0%"}}]
["Cancelled",{"$f":"COUNTIF(Sprint!$K:K, $A25)","v":0},{"$f":"SUMIF(Sprint!K:K,'Project Report'!$A25,Sprint!EI:EI)","v":0},{"$f":"Table3[[#This Row],[Hours Sum]]/Table3[[#Totals],[Hours Sum]]","v":{"v":0,"d":"0%"}}]
["Total",{"$f":"SUBTOTAL(109,Table3[Count])","v":10},{"$f":"SUBTOTAL(109,Table3[Hours Sum])","v":52},{"$f":"SUBTOTAL(109,Table3[% Hours])","v":{"v":1,"d":"100%"}}]