{"text_format":"3","workbook":"xlsx","n_sheets":2,"sheets":["Existências","Encomenda"],"read":"whole","date_system":"1900"}

{"sheet":"Existências","index":0,"n_rows":13669,"n_cols":4,"rows_kept":13669}
[null,"Refª","Qt","Peso unit (g)"]
[null,"AAAJ748",315,423]
[null,"AAAR258",188,300]
[null,"AACC235",191,1160]
[null,"AACI657",305,1098]
[null,"AAEV849",315,1090]
[null,"AAGP626",286,1103]
[null,"AAKP890",296,465]
[null,"AALT144",171,1038]
[null,"AAOH135",182,1212]
[null,"AAOV628",306,1154]
[null,"AARB179",178,978]
[null,"AATK240",171,1074]
[null,"AAUC367",172,410]
[null,"AAUT327",155,607]
[null,"AAVW799",300,1085]
[null,"AAVX388",175,680]
[null,"AAWX241",184,967]
[null,"AAXU257",156,637]
[null,"ABAF769",301,1492]
[null,"ABBJ515",312,1397]
[null,"ABBS846",284,1174]
[null,"ABDT386",161,596]
[null,"ABHG436",181,665]
[null,"ABJC802",305,945]
[null,"ABJV360",193,615]
[null,"ABKG925",307,363]
[null,"ABKK530",323,723]
[null,"ABQT651",292,1362]
[null,"ABTL273",182,655]
[null,"ABUL388",177,544]
[null,"ABWA144",172,920]
[null,"ABXA153",161,1137]
[null,"ABXV158",181,950]
[null,"ACAB159",185,1192]
[null,"ACCI563",292,938]
[null,"ACDU368",156,605]
[null,"ACFQ501",295,550]
[null,"ACFX550",278,898]
[null,"ACGA811",304,1259]
[null,"ACGU398",150,584]
[null,"ACIE653",292,1258]
[null,"ACJH331",160,689]
[null,"ACKO364",153,627]
[null,"ACLK791",298,386]
[null,"ACLS574",280,1333]
[null,"ACNS399",155,588]
[null,"ACPU340",151,300]
[null,"ACUP195",184,1054]
[null,"ACVE197",170,1084]
[null,"ACWC290",161,567]
[null,"ACWK403",173,592]
[null,"ACXR884",296,380]
[null,"ACYN455",180,715]
[null,"ADAQ333",173,546]
[null,"ADBS164",192,1086]
[null,"ADCM751",304,1335]
[null,"ADGA746",295,627]
[null,"ADGG442",174,435]
[null,"ADHO241",178,1103]
[null,"ADKH111",194,1063]
[null,"ADKL220",165,1003]
[null,"ADKN493",186,593]
[null,"ADKX371",189,407]
[null,"ADLN539",297,659]
[null,"ADNC614",302,1330]
[null,"ADOA455",175,527]
[null,"ADOI106",153,1138]
[null,"ADPC712",302,601]
[null,"ADPU280",184,751]
[null,"ADSF721",291,1493]
[null,"ADVJ213",179,1015]
[null,"AECQ129",194,976]
[null,"AECU274",175,632]
[null,"AEEO815",296,1108]
[null,"AEGK807",257,228]
[null,"AEHS774",292,1224]
[null,"AEIY233",182,1005]
[null,"AEJF444",159,493]
[null,"AEJF709",272,384]
[null,"AEKC622",305,1376]
[null,"AEKD122",144,931]
[null,"AEKI836",300,511]
[null,"AEMG784",277,303]
[null,"AENG623",283,595]
[null,"AENY201",189,1049]
[null,"AERM770",324,1012]
[null,"AESK253",159,522]
[null,"AEVV878",284,1396]
[null,"AEWT273",156,607]
[null,"AEYP117",169,965]
[null,"AFDM844",294,1368]
[null,"AFEG187",192,929]
[null,"AFEV492",145,501]
[null,"AFFH582",335,757]
[null,"AFGL199",182,1127]
[null,"AFHL583",303,1070]
[null,"AFJI192",153,1078]
[null,"AFJN197",198,1109]
[null,"AFLI373",181,655]
[null,"AFOA380",153,570]
[null,"AFPA111",167,1009]
[null,"AFPQ423",178,486]
[null,"AFQJ930",295,292]
[null,"AFQU915",306,762]
[null,"AFRV380",157,752]
[null,"AFSF202",148,1081]
[null,"AFXO297",151,594]
[null,"AGBR560",288,1297]
[null,"AGBU370",173,563]
[null,"AGCC531",288,1109]
[null,"AGDO599",299,420]
[null,"AGGW668",277,1227]
[null,"AGHA381",148,615]
[null,"AGIW557",322,997]
[null,"AGJG217",172,864]
[null,"AGKC368",163,512]
[null,"AGMK376",186,599]
[null,"AGMX599",285,825]
[null,"AGPV672",292,679]
[null,"AGTX806",317,473]
[null,"AGUR855",300,531]
[null,"AGUS526",296,843]
[null,"AGYG459",176,673]
[null,"AGYP841",282,971]
[null,"AHAU796",311,212]
[null,"AHBQ500",291,1359]
[null,"AHCX322",170,532]
[null,"AHDK167",163,1020]
[null,"AHDY791",304,268]
[null,"AHEX125",157,1109]
[null,"AHFC626",289,622]
[null,"AHGY148",180,1078]
[null,"AHHM141",161,1067]
[null,"AHIK859",308,1215]
[null,"AHNA899",278,804]
[null,"AHNH267",176,594]
[null,"AHOU218",201,983]
[null,"AHRD896",290,400]
[null,"AHRT560",297,1373]
[null,"AHTL721",313,1112]
[null,"AHTY358",183,499]
[null,"AHVO832",304,311]
[null,"AHWG710",304,1291]
[null,"AHXN407",170,477]
[null,"AHYP689",276,633]
[null,"AIBW807",293,1426]
[null,"AICS387",174,313]
[null,"AICY938",297,1050]
[null,"AIDV574",278,714]
[null,"AIEK276",149,283]
[null,"AIGV814",293,1181]
[null,"AIHY635",310,235]
[null,"AIIE631",273,544]
[null,"AIKL105",175,1069]
[null,"AILO813",277,704]
[null,"AIMF565",327,1050]
[null,"AIMN763",286,1482]
[null,"AINB568",289,1012]
[null,"AIQC854",290,1111]
[null,"AIQD858",293,352]
[null,"AIRK440",175,731]
[null,"AIRN273",175,601]
[null,"AIRQ641",285,491]
[null,"AISE648",300,810]
[null,"AISV424",175,431]
[null,"AIUR401",167,577]
[null,"AIVL335",143,482]
[null,"AIXB253",178,541]
[null,"AIXE704",287,1367]
[null,"AIYQ822",292,1269]
[null,"AJCR910",304,1043]
[null,"AJEC813",286,1030]
[null,"AJGU695",316,602]
[null,"AJII902",299,1199]
[null,"AJLG910",312,599]
[null,"AJLM240",175,1058]
[null,"AJOD253",182,427]
[null,"AJQC834",294,1434]
[null,"AJQX769",310,1423]
[null,"AJSB837",291,1295]
[null,"AJTR570",299,920]
[null,"AJUU393",176,498]
[null,"AJWK303",182,691]
[null,"AJWU857",293,1087]
[null,"AJXP831",306,1343]
[null,"AJXT297",179,764]
[null,"AJYK559",281,696]
[null,"AJYL374",173,504]
[null,"AJYY625",302,271]
[null,"AKBF140",185,1044]
[null,"AKDH423",179,720]
[null,"AKGO915",301,580]
[null,"AKHF496",203,625]
[null,"AKHK132",190,998]
[null,"AKID453",178,782]
[null,"AKJH134",186,1112]
[null,"AKKV739",287,1489]
[null,"AKLB268",190,360]
[null,"AKLG354",177,303]
[null,"AKMK311",165,685]
[null,"AKNN568",280,952]
[null,"AKNW334",174,761]
[null,"AKON737",292,344]
[null,"AKSJ191",161,987]
[null,"AKTN873",320,1303]
[null,"AKUK143",161,1117]
[null,"AKYE628",279,386]
[null,"ALAM651",295,1287]
[null,"ALBG124",186,1143]
[null,"ALBI452",166,552]
[null,"ALCV322",152,750]
[null,"ALEB926",289,519]
[null,"ALEU840",280,331]
[null,"ALFL834",320,1360]
[null,"ALFU382",189,768]
[null,"ALFX877",290,516]
[null,"ALGU220",186,1113]
[null,"ALHT184",184,1133]
[null,"ALID784",288,202]
[null,"ALIS381",180,536]
[null,"ALIW602",275,1300]
[null,"ALKH666",275,807]
[null,"ALKJ931",271,1398]
[null,"ALMV160",171,1030]
[null,"ALMW462",169,397]
[null,"ALNN127",191,1056]
[null,"ALQF336",173,456]
[null,"ALSL320",173,508]
[null,"ALWB144",185,1005]
[null,"AMAD266",189,318]
[null,"AMAS434",167,422]
[null,"AMBE752",287,1014]
[null,"AMBK466",208,726]
[null,"AMCO911",299,269]
[null,"AMDJ364",176,558]
[null,"AMDU348",191,313]
[null,"AMED688",306,1408]
[null,"AMFI595",272,895]
[null,"AMFO681",291,1059]
[null,"AMGI114",178,1172]
[null,"AMGK688",287,643]
[null,"AMGW913",297,1130]
[null,"AMHE311",184,409]
[null,"AMHU537",302,320]
[null,"AMIM119",141,1082]
[null,"AMJQ565",297,902]
[null,"AMKS547",314,285]
[null,"AMLA298",191,550]
[null,"AMLG470",172,567]
[null,"AMNB544",273,1141]
[null,"AMOC512",291,1324]
[null,"AMQQ927",296,312]
[null,"AMQU752",292,448]
[null,"AMTQ887",271,609]
[null,"AMTW598",302,1414]
[null,"AMUP728",265,1458]
[null,"AMVB323",175,662]
[null,"AMVI176",188,1020]
[null,"AMWI697",304,223]
[null,"AMXD625",301,339]
[null,"AMXP246",193,991]
[null,"AMYA411",182,401]
[null,"AMYI690",292,549]
[null,"AMYO314",172,618]
[null,"ANAE838",313,445]
[null,"ANAU763",286,1401]
[null,"ANCB594",291,770]
[null,"ANCH321",181,470]
[null,"ANFT439",166,449]
[null,"ANGO616",280,1469]
[null,"ANGY662",277,1410]
[null,"ANHY523",297,841]
[null,"ANIV206",173,1051]
[null,"ANJD553",301,1063]
[null,"ANJS698",302,1054]
[null,"ANKJ629",300,737]
[null,"ANKY704",257,1020]
[null,"ANLD512",283,332]
[null,"ANOR840",320,881]
[null,"ANOX512",287,229]
[null,"ANQA159",208,996]
[null,"ANQA853",308,237]
[null,"ANTO446",164,455]
[null,"ANVE767",312,623]
[null,"ANWJ563",290,728]
[null,"ANWU474",179,561]
[null,"ANXB940",298,850]
[null,"ANXV567",301,1396]
[null,"ANYM458",185,394]
[null,"AOAL771",308,245]
[null,"AOCE426",184,449]
[null,"AOEL538",312,1403]
[null,"AOFV387",169,501]
[null,"AOHY404",187,468]
[null,"AOII292",197,543]
[null,"AOIS240",155,1023]
[null,"AOIX357",189,449]
[null,"AOLM760",255,478]
[null,"AOPN885",295,918]
[null,"AORD371",167,762]
[null,"AOTL225",147,981]
[null,"AOUR741",278,464]
[null,"AOVR101",167,1038]
[null,"AOVW572",309,1305]
[null,"AOWB442",163,798]
[null,"AOWC887",308,713]
[null,"AOXB880",289,1464]
[null,"APCS877",311,363]
[null,"APDA781",286,1011]
[null,"APDP937",279,1448]
[null,"APEV833",288,332]
[null,"APFF326",182,533]
[null,"APHP242",175,1142]
[null,"APHV300",172,510]
[null,"APJV355",179,356]
[null,"APKC255",177,446]
[null,"APLI825",295,441]
[null,"APMN803",298,1001]
[null,"APNI520",318,360]
[null,"APOC784",309,1228]
[null,"APOI595",285,721]
[null,"APRS661",306,1474]
[null,"APUW494",183,321]
[null,"APXE358",161,624]
[null,"AQAA286",181,525]
[null,"AQAH806",310,764]
[null,"AQBD669",289,1019]
[null,"AQBN418",164,734]
[null,"AQBQ247",175,1086]
[null,"AQCD546",289,588]
[null,"AQDS555",304,378]
[null,"AQFT791",303,1406]
[null,"AQHA721",309,1360]
[null,"AQHI951",282,1247]
[null,"AQHP398",186,668]
[null,"AQIN684",292,1057]
[null,"AQJO557",292,1446]
[null,"AQMU387",183,495]
[null,"AQNL328",171,624]
[null,"AQOW235",195,1111]
[null,"AQQU142",164,984]
[null,"AQRH176",187,967]
[null,"AQSG335",187,686]
[null,"AQSV246",164,925]
[null,"AQTT168",173,994]
[null,"AQUX206",151,963]
[null,"AQVC837",292,968]
[null,"AQWC788",316,298]
[null,"AQWI922",303,671]
[null,"AQXF797",272,828]
[null,"AQXS591",289,631]
[null,"AQXV335",173,317]
[null,"AQYW103",160,954]
[null,"ARBE368",182,354]
[null,"ARBG546",294,1072]
[null,"ARBO300",179,687]
[null,"ARCA768",303,583]
[null,"ARFF947",272,259]
[null,"ARGO798",330,1348]
[null,"ARJD476",176,433]
[null,"ARLB515",280,1473]
[null,"ARLN877",327,1396]
[null,"ARNY202",172,1032]
[null,"ARQY881",305,351]
[null,"ARRW622",294,259]
[null,"ARTD267",191,480]
[null,"ARTS612",290,1488]
[null,"ARUI215",150,1075]
[null,"ARUL141",151,1096]
[null,"ARWI399",162,488]
[null,"ARWM370",186,404]
[null,"ARXR131",147,1078]
[null,"ARYA503",290,317]
[null,"ARYD122",164,1178]
[null,"ARYX637",286,943]
[null,"ASCI810",291,405]
[null,"ASCK294",191,625]
[null,"ASCY265",208,594]
[null,"ASDA735",291,1400]
[null,"ASDU838",271,1343]
[null,"ASEG811",293,513]
[null,"ASFI298",159,560]
[null,"ASFQ592",292,840]
[null,"ASGC471",172,476]
[null,"ASGE315",207,511]
[null,"ASHB431",170,534]
[null,"ASHO723",288,795]
[null,"ASIA215",154,950]
[null,"ASIY774",275,829]
[null,"ASJV341",179,479]
[null,"ASKC932",301,723]
[null,"ASKE760",308,936]
[null,"ASNT943",303,339]
[null,"ASOQ185",194,1070]
[null,"ASQT249",183,993]
[null,"ASQU151",172,1017]
[null,"ASSB748",285,1193]
[null,"ASSI914",306,604]
[null,"ASTE812",297,709]
{"$rows_left_out":13270}
{"sheet":"Encomenda","index":1,"n_rows":35,"n_cols":11,"rows_kept":35}
[]
[]
[null,"Encomenda n.440/2017"]
[]
[null,"Refª","Qt encom","St Inicial (S0)","St Insuf?","Qt a enviar","P_tot (kg)","St final (SF)","SF < 0,1 S0?",null,"P_tot_Enc:"]
[null,"ONUI954",75,{"$f":"VLOOKUP(B6, Existências!$B$2:$D$13669, 2,FALSE)","v":306},{"$f":"IF(D6 < C6, \"*\", \"\")","v":""},{"$f":"IF(C6 <= D6, C6, D6)","v":75},{"$f":"F6*VLOOKUP(B6, Existências!$B$2:$D$13669, 3, FALSE)/1000","v":{"v":34.275,"d":"34.28"}},{"$f":"IF(D6-C6 < 0, 0, D6-C6)","v":231},{"$f":"IF(H6 < 0.1*D6, \"***\", \"\")","v":""},null,{"$f":"SUM(G6:G25)","v":{"v":2561.515,"d":"2561.52"}}]
[null,"EEQX274",194,{"$f":"VLOOKUP(B7, Existências!$B$2:$D$13669, 2,FALSE)","v":194},"",194,{"$f":"F7*VLOOKUP(B7, Existências!$B$2:$D$13669, 3, FALSE)/1000","v":{"v":91.762,"d":"91.76"}},0,"***"]
[null,"XIIC592",339,{"$f":"VLOOKUP(B8, Existências!$B$2:$D$13669, 2,FALSE)","v":311},"*",311,{"$f":"F8*VLOOKUP(B8, Existências!$B$2:$D$13669, 3, FALSE)/1000","v":{"v":92.056,"d":"92.06"}},0,"***"]
[null,"VWEG325",132,{"$f":"VLOOKUP(B9, Existências!$B$2:$D$13669, 2,FALSE)","v":181},"",132,{"$f":"F9*VLOOKUP(B9, Existências!$B$2:$D$13669, 3, FALSE)/1000","v":{"v":55.572,"d":"55.57"}},49,""]
[null,"GYQE778",279,{"$f":"VLOOKUP(B10, Existências!$B$2:$D$13669, 2,FALSE)","v":301},"",279,{"$f":"F10*VLOOKUP(B10, Existências!$B$2:$D$13669, 3, FALSE)/1000","v":{"v":120.807,"d":"120.81"}},22,"***"]
[null,"YOME285",71,{"$f":"VLOOKUP(B11, Existências!$B$2:$D$13669, 2,FALSE)","v":168},"",71,{"$f":"F11*VLOOKUP(B11, Existências!$B$2:$D$13669, 3, FALSE)/1000","v":{"v":44.801,"d":"44.80"}},97,""]
[null,"QRAF698",93,{"$f":"VLOOKUP(B12, Existências!$B$2:$D$13669, 2,FALSE)","v":302},"",93,{"$f":"F12*VLOOKUP(B12, Existências!$B$2:$D$13669, 3, FALSE)/1000","v":{"v":42.315,"d":"42.32"}},209,""]
[null,"CQEY117",113,{"$f":"VLOOKUP(B13, Existências!$B$2:$D$13669, 2,FALSE)","v":183},"",113,{"$f":"F13*VLOOKUP(B13, Existências!$B$2:$D$13669, 3, FALSE)/1000","v":{"v":132.323,"d":"132.32"}},70,""]
[null,"BTCP305",173,{"$f":"VLOOKUP(B14, Existências!$B$2:$D$13669, 2,FALSE)","v":157},"*",157,{"$f":"F14*VLOOKUP(B14, Existências!$B$2:$D$13669, 3, FALSE)/1000","v":{"v":101.736,"d":"101.74"}},0,"***"]
[null,"WBRH538",304,{"$f":"VLOOKUP(B15, Existências!$B$2:$D$13669, 2,FALSE)","v":316},"",304,{"$f":"F15*VLOOKUP(B15, Existências!$B$2:$D$13669, 3, FALSE)/1000","v":{"v":434.112,"d":"434.11"}},12,"***"]
[null,"NVUI859",198,{"$f":"VLOOKUP(B16, Existências!$B$2:$D$13669, 2,FALSE)","v":311},"",198,{"$f":"F16*VLOOKUP(B16, Existências!$B$2:$D$13669, 3, FALSE)/1000","v":{"v":274.824,"d":"274.82"}},113,""]
[null,"EIRK220",199,{"$f":"VLOOKUP(B17, Existências!$B$2:$D$13669, 2,FALSE)","v":204},"",199,{"$f":"F17*VLOOKUP(B17, Existências!$B$2:$D$13669, 3, FALSE)/1000","v":{"v":218.701,"d":"218.70"}},5,"***"]
[null,"NROH853",230,{"$f":"VLOOKUP(B18, Existências!$B$2:$D$13669, 2,FALSE)","v":291},"",230,{"$f":"F18*VLOOKUP(B18, Existências!$B$2:$D$13669, 3, FALSE)/1000","v":240.12},61,""]
[null,"OKFX484",174,{"$f":"VLOOKUP(B19, Existências!$B$2:$D$13669, 2,FALSE)","v":175},"",174,{"$f":"F19*VLOOKUP(B19, Existências!$B$2:$D$13669, 3, FALSE)/1000","v":{"v":95.352,"d":"95.35"}},1,"***"]
[null,"RNWU222",62,{"$f":"VLOOKUP(B20, Existências!$B$2:$D$13669, 2,FALSE)","v":143},"",62,{"$f":"F20*VLOOKUP(B20, Existências!$B$2:$D$13669, 3, FALSE)/1000","v":{"v":62.806,"d":"62.81"}},81,""]
[null,"KQWP848",177,{"$f":"VLOOKUP(B21, Existências!$B$2:$D$13669, 2,FALSE)","v":282},"",177,{"$f":"F21*VLOOKUP(B21, Existências!$B$2:$D$13669, 3, FALSE)/1000","v":{"v":156.999,"d":"157.00"}},105,""]
[null,"FRJS175",143,{"$f":"VLOOKUP(B22, Existências!$B$2:$D$13669, 2,FALSE)","v":150},"",143,{"$f":"F22*VLOOKUP(B22, Existências!$B$2:$D$13669, 3, FALSE)/1000","v":{"v":153.725,"d":"153.73"}},7,"***"]
[null,"FJHV521",71,{"$f":"VLOOKUP(B23, Existências!$B$2:$D$13669, 2,FALSE)","v":303},"",71,{"$f":"F23*VLOOKUP(B23, Existências!$B$2:$D$13669, 3, FALSE)/1000","v":{"v":51.333,"d":"51.33"}},232,""]
[null,"HJPG309",172,{"$f":"VLOOKUP(B24, Existências!$B$2:$D$13669, 2,FALSE)","v":166},"*",166,{"$f":"F24*VLOOKUP(B24, Existências!$B$2:$D$13669, 3, FALSE)/1000","v":{"v":85.656,"d":"85.66"}},0,"***"]
[null,"FIMR370",189,{"$f":"VLOOKUP(B25, Existências!$B$2:$D$13669, 2,FALSE)","v":168},"*",168,{"$f":"F25*VLOOKUP(B25, Existências!$B$2:$D$13669, 3, FALSE)/1000","v":72.24},0,"***"]
[]
[]
[null,"As células a amarelo devem ser programadas para originar o seu preenchimento automático."]
[null,"Col D: Indicar o Stock Inicial, S0, (ver Existências)."]
[null,"Col E: Se o Stock Inicial, S0, for inferior à Quantidade encomendada, assinalar *; caso contrário, nada assinalar."]
[null,"Col F: Determinar o valor a enviar - o total encomendado ou, caso tal seja impossível, a quantidade existente."]
[null,"Col G: Determinar o peso total (em kg) correspondente ao envio. (Ver Existências)"]
[null,"Col H: Determinar o Stock final, SF, após o processamento desta encomenda."]
[null,"Col I: Se SF for inferior a 10% de S0, indicar ***; caso contrário, nada indicar."]
[null,"Célula K6: determinar o peso total da encomenda a expedir (em kg)."]